Phenol
- Formula: C6H6O
- Molecular weight: 94.1112
- IUPAC Standard InChIKey: ISWSIDIOOBJBQZ-UHFFFAOYSA-N
- CAS Registry Number: 108-95-2
- Chemical structure:
View 3d structure (requires JavaScript / HTML 5) - Isotopologues:
- Other names: Carbolic acid; Baker's P and S Liquid and Ointment; Benzenol; Hydroxybenzene; Izal; Monohydroxybenzene; Monophenol; Oxybenzene; Phenic acid; Phenyl alcohol; Phenyl hydrate; Phenyl hydroxide; Phenylic acid; Phenylic alcohol; PhOH; Benzene, hydroxy-; Acide carbolique; Baker's P & S liquid & Ointment; Fenol; Fenolo; NCI-C50124; Paoscle; Phenole; Carbolsaure; NA 2821; Phenol alcohol; Phenol, molten; Rcra waste number U188; UN 1671; UN 2312; UN 2821; Phenic alcohol; NSC 36808; Campho-Phenique Cold Sore Gel (Salt/Mix); Campho-Phenique Gel (Salt/Mix); Campho-Phenique Liquid (Salt/Mix)

Gas phase thermochemistry data

Data compiled as indicated in comments:
ALS - Hussein Y. Afeefy, Joel F. Liebman, and Stephen E. Stein
DRB - Donald R. Burgess, Jr.
GT - Glushko Thermocenter, Russian Academy of Sciences, Moscow
Quantity | Value | Units | Method | Reference | Comment |
---|---|---|---|---|---|
ΔfH°gas | -96.36 ± 0.59 | kJ/mol | Ccb | Cox, 1961 | ALS |
ΔfH°gas | -96.44 ± 0.63 | kJ/mol | Ccb | Andon, Biddiscombe, et al., 1960 | ALS |
ΔfH°gas | -94.2 | kJ/mol | N/A | Parks, Manchester, et al., 1954 | Value computed using ΔfHsolid° value of -162.8±1.0 kj/mol from Parks, Manchester, et al., 1954 and ΔsubH° value of 68.6 kj/mol from Cox, 1961.; DRB |
ΔfH°gas | -95.3 | kJ/mol | N/A | Badoche, 1941 | Value computed using ΔfHsolid° value of -163.9 kj/mol from Badoche, 1941 and ΔsubH° value of 68.6 kj/mol from Cox, 1961.; DRB |
Constant pressure heat capacity of gas
Cp,gas (J/mol*K) | Temperature (K) | Reference | Comment |
---|---|---|---|
33.91 | 50. | Kudchadker S.A., 1978 | Recommended S(T) and Cp(T) values are in close agreement with statistical values calculated by [ Evans J.C., 1960, Green J.H.S., 1961]. Entropy value calculated by [ Sarin V.N., 1973] agrees well with the third-law entropy at 298.15 K but not at 400 K. Statistical values calculated by [ Ramaswamy V., 1970] seem to be erroneous.; GT |
41.38 | 100. | ||
54.19 | 150. | ||
69.65 | 200. | ||
94.61 | 273.15 | ||
103.22 | 298.15 | ||
103.86 | 300. | ||
135.79 | 400. | ||
161.91 | 500. | ||
182.48 | 600. | ||
198.84 | 700. | ||
212.14 | 800. | ||
223.19 | 900. | ||
232.49 | 1000. | ||
240.41 | 1100. | ||
247.20 | 1200. | ||
253.06 | 1300. | ||
258.12 | 1400. | ||
262.52 | 1500. |

Reaction thermochemistry data

Data compiled as indicated in comments:
B - John E. Bartmess
M - Michael M. Meot-Ner (Mautner) and Sharon G. Lias
RCD - Robert C. Dunbar
ALS - Hussein Y. Afeefy, Joel F. Liebman, and Stephen E. Stein
MS - José A. Martinho Simões
Individual Reactions
By formula: C6H5O- + H+ = C6H6O
Quantity | Value | Units | Method | Reference | Comment |
---|---|---|---|---|---|
ΔrH° | 1462. ± 10. | kJ/mol | AVG | N/A | Average of 6 out of 7 values; Individual data points |
Quantity | Value | Units | Method | Reference | Comment |
ΔrG° | 1432. ± 8.4 | kJ/mol | IMRE | Bartmess, Scott, et al., 1979 | gas phase; Shiner, Vorner, et al., 1986: tautomer acidities ΔHacid(ortho) = 343.9±3.1 kcal, para = 340.1±2 kcal. However, Capponi, Gut, et al., 1999 based on aq. soln. results, imply 18 and 14 kcal/mol difference.; value altered from reference due to change in acidity scale; B |
ΔrG° | 1426. ± 7.9 | kJ/mol | CIDC | Angel and Ervin, 2004 | gas phase; B |
ΔrG° | 1437. ± 8.4 | kJ/mol | IMRE | Cumming and Kebarle, 1978 | gas phase; B |
ΔrG° | >1429. ± 7.5 | kJ/mol | H-TS | Richardson, Stephenson, et al., 1975 | gas phase; B |
By formula: Cl- + C6H6O = (Cl- • C6H6O)
Quantity | Value | Units | Method | Reference | Comment |
---|---|---|---|---|---|
ΔrH° | 109. ± 8.4 | kJ/mol | TDAs | French, Ikuta, et al., 1982 | gas phase; B,M |
ΔrH° | 109. ± 8.4 | kJ/mol | TDEq | Cummings, French, et al., 1977 | gas phase; Re-anchored to data in French, Ikuta, et al., 1982.; B |
ΔrH° | 115. | kJ/mol | PHPMS | Kebarle, 1977 | gas phase; M |
ΔrH° | 111. | kJ/mol | PHPMS | Paul and Kebarle, 1990 | gas phase; Entropy change calculated or estimated; M |
ΔrH° | 81.2 ± 8.4 | kJ/mol | TDAs | Yamdagni and Kebarle, 1971 | gas phase; B,M |
Quantity | Value | Units | Method | Reference | Comment |
ΔrS° | 109. | J/mol*K | PHPMS | French, Ikuta, et al., 1982 | gas phase; M |
ΔrS° | 100. | J/mol*K | PHPMS | Kebarle, 1977 | gas phase; M |
ΔrS° | 100. | J/mol*K | N/A | Paul and Kebarle, 1990 | gas phase; Entropy change calculated or estimated; M |
ΔrS° | 64.9 | J/mol*K | PHPMS | Yamdagni and Kebarle, 1971 | gas phase; M |
Quantity | Value | Units | Method | Reference | Comment |
ΔrG° | 80.3 ± 8.4 | kJ/mol | TDAs | French, Ikuta, et al., 1982 | gas phase; B |
ΔrG° | 77.4 ± 8.4 | kJ/mol | TDEq | Cummings, French, et al., 1977 | gas phase; Re-anchored to data in French, Ikuta, et al., 1982.; B |
ΔrG° | 61.9 ± 8.4 | kJ/mol | TDAs | Yamdagni and Kebarle, 1971 | gas phase; B |
Free energy of reaction
ΔrG° (kJ/mol) | T (K) | Method | Reference | Comment |
---|---|---|---|---|
66.5 | 423. | PHPMS | Paul and Kebarle, 1990 | gas phase; Entropy change calculated or estimated; M |
By formula: F- + C6H6O = (F- • C6H6O)
Quantity | Value | Units | Method | Reference | Comment |
---|---|---|---|---|---|
ΔrH° | 173. ± 8.4 | kJ/mol | IMRE | Larson and McMahon, 1983 | gas phase; These relative affinities are ca. 10 kcal/mol weaker than threshold values (see Wenthold and Squires, 1995) for donors greater than ca. 27 kcal/mol in free energy. This discrepancy has not yet been resolved, though the stronger value appears preferable.; B,M |
Quantity | Value | Units | Method | Reference | Comment |
ΔrS° | 110. | J/mol*K | N/A | Larson and McMahon, 1983 | gas phase; switching reaction(F-)H2O, Entropy change calculated or estimated; Arshadi, Yamdagni, et al., 1970; M |
Quantity | Value | Units | Method | Reference | Comment |
ΔrG° | 140. ± 8.4 | kJ/mol | IMRE | Larson and McMahon, 1983 | gas phase; These relative affinities are ca. 10 kcal/mol weaker than threshold values (see Wenthold and Squires, 1995) for donors greater than ca. 27 kcal/mol in free energy. This discrepancy has not yet been resolved, though the stronger value appears preferable.; B,M |
By formula: Br- + C6H6O = (Br- • C6H6O)
Quantity | Value | Units | Method | Reference | Comment |
---|---|---|---|---|---|
ΔrH° | 87.0 ± 7.5 | kJ/mol | IMRE | Paul and Kebarle, 1990 | gas phase; ΔGaff at 423 K; B,M |
ΔrH° | 82.0 | kJ/mol | PHPMS | Paul and Kebarle, 1991 | gas phase; Entropy change calculated or estimated; M |
Quantity | Value | Units | Method | Reference | Comment |
ΔrS° | 84. | J/mol*K | N/A | Paul and Kebarle, 1991 | gas phase; Entropy change calculated or estimated; M |
ΔrS° | 96. | J/mol*K | N/A | Paul and Kebarle, 1990 | gas phase; Entropy change calculated or estimated; M |
Quantity | Value | Units | Method | Reference | Comment |
ΔrG° | 46.4 ± 4.2 | kJ/mol | IMRE | Paul and Kebarle, 1990 | gas phase; ΔGaff at 423 K; B |
Free energy of reaction
ΔrG° (kJ/mol) | T (K) | Method | Reference | Comment |
---|---|---|---|---|
46.4 | 423. | PHPMS | Paul and Kebarle, 1991 | gas phase; Entropy change calculated or estimated; M |
46.4 | 423. | PHPMS | Paul and Kebarle, 1990 | gas phase; Entropy change calculated or estimated; M |
By formula: I- + C6H6O = (I- • C6H6O)
Quantity | Value | Units | Method | Reference | Comment |
---|---|---|---|---|---|
ΔrH° | 72.4 ± 7.5 | kJ/mol | IMRE | Paul and Kebarle, 1990 | gas phase; ΔGaff at 423 K; B,M |
Quantity | Value | Units | Method | Reference | Comment |
ΔrS° | 88. | J/mol*K | N/A | Paul and Kebarle, 1990 | gas phase; Entropy change calculated or estimated; M |
Quantity | Value | Units | Method | Reference | Comment |
ΔrG° | 35. ± 4.2 | kJ/mol | IMRE | Paul and Kebarle, 1990 | gas phase; ΔGaff at 423 K; B |
Free energy of reaction
ΔrG° (kJ/mol) | T (K) | Method | Reference | Comment |
---|---|---|---|---|
35. | 423. | PHPMS | Paul and Kebarle, 1990 | gas phase; Entropy change calculated or estimated; M |
By formula: C2H3O2- + C6H6O = (C2H3O2- • C6H6O)
Quantity | Value | Units | Method | Reference | Comment |
---|---|---|---|---|---|
ΔrH° | 109. ± 4.2 | kJ/mol | N/A | Meot-Ner and Sieck, 1986 | gas phase; B,M |
Quantity | Value | Units | Method | Reference | Comment |
ΔrS° | 100. | J/mol*K | PHPMS | Meot-Ner and Sieck, 1986 | gas phase; M |
Quantity | Value | Units | Method | Reference | Comment |
ΔrG° | 79.1 ± 6.7 | kJ/mol | TDAs | Meot-Ner and Sieck, 1986 | gas phase; B |
By formula: Na+ + C6H6O = (Na+ • C6H6O)
Quantity | Value | Units | Method | Reference | Comment |
---|---|---|---|---|---|
ΔrH° | 102. ± 3. | kJ/mol | CIDT | Amunugama and Rodgers, 2002 | RCD |
ΔrH° | 98. ± 3. | kJ/mol | CIDT | Armentrout and Rodgers, 2000 | RCD |
Free energy of reaction
ΔrG° (kJ/mol) | T (K) | Method | Reference | Comment |
---|---|---|---|---|
69.9 | 298. | IMRE | McMahon and Ohanessian, 2000 | Anchor alanine=39.89; RCD |
By formula: C6H6O + C12H18O = C9H12O + C9H12O
Quantity | Value | Units | Method | Reference | Comment |
---|---|---|---|---|---|
ΔrH° | -0.7 ± 1.0 | kJ/mol | Eqk | Nesterova, Pimerzin, et al., 1989 | liquid phase; Isomerization; ALS |
ΔrH° | -0.7 ± 1.0 | kJ/mol | Eqk | Nesterova, Pilyshchikov, et al., 1983 | liquid phase; GC; ALS |
C22H20O2Ti (cr) + 2( • 5.55
) (solution) = 2
(cr) +
(cr)
By formula: C22H20O2Ti (cr) + 2(HCl • 5.55H2O) (solution) = 2C6H6O (cr) + C10H10Cl2Ti (cr)
Quantity | Value | Units | Method | Reference | Comment |
---|---|---|---|---|---|
ΔrH° | -5.8 ± 2.5 | kJ/mol | RSC | Dias, Salema, et al., 1981 | Please also see Calhorda, Carrondo, et al., 1986.; MS |
(solution) + C5H11BrMg (solution) = C6H5BrMgO (solution) +
(solution)
By formula: C6H6O (solution) + C5H11BrMg (solution) = C6H5BrMgO (solution) + C5H12 (solution)
Quantity | Value | Units | Method | Reference | Comment |
---|---|---|---|---|---|
ΔrH° | -202.5 ± 4.2 | kJ/mol | RSC | Holm, 1983 | solvent: Diethyl ether; MS |
C20H32Zr (solution) + (solution) = C26H36OZr (solution) +
(g)
By formula: C20H32Zr (solution) + C6H6O (solution) = C26H36OZr (solution) + H2 (g)
Quantity | Value | Units | Method | Reference | Comment |
---|---|---|---|---|---|
ΔrH° | -132.6 ± 1.7 | kJ/mol | RSC | Schock and Marks, 1988 | solvent: Toluene; MS |
C26H36OZr (solution) + (solution) = C32H40O2Zr (solution) +
(g)
By formula: C26H36OZr (solution) + C6H6O (solution) = C32H40O2Zr (solution) + H2 (g)
Quantity | Value | Units | Method | Reference | Comment |
---|---|---|---|---|---|
ΔrH° | -86.6 ± 2.9 | kJ/mol | RSC | Schock and Marks, 1988 | solvent: Toluene; MS |
By formula: C8H8O2 + H2O = C6H6O + C2H4O2
Quantity | Value | Units | Method | Reference | Comment |
---|---|---|---|---|---|
ΔrH° | -28.7 ± 0.2 | kJ/mol | Cm | Wadso, 1960 | liquid phase; Heat of hydrolysis; ALS |
By formula: C6H6O + C14H22O = C10H14O + C10H14O
Quantity | Value | Units | Method | Reference | Comment |
---|---|---|---|---|---|
ΔrH° | -2.6 ± 1.1 | kJ/mol | Eqk | Nesterova, Pimerzin, et al., 1989 | liquid phase; Isomerization; ALS |
+ C18H30O =
+
By formula: C6H6O + C18H30O = C14H22O + C10H14O
Quantity | Value | Units | Method | Reference | Comment |
---|---|---|---|---|---|
ΔrH° | -1.7 ± 1.5 | kJ/mol | Eqk | Nesterova, Pimerzin, et al., 1989 | liquid phase; Isomerization; ALS |
By formula: C6H6O + C14H22O = C10H14O + C10H14O
Quantity | Value | Units | Method | Reference | Comment |
---|---|---|---|---|---|
ΔrH° | -3.2 ± 1.9 | kJ/mol | Eqk | Nesterova, Pimerzin, et al., 1989 | liquid phase; Isomerization; ALS |
By formula: C6H6O + C14H22O = 2C10H14O
Quantity | Value | Units | Method | Reference | Comment |
---|---|---|---|---|---|
ΔrH° | -1.3 ± 2.1 | kJ/mol | Eqk | Nesterova, Pimerzin, et al., 1989 | liquid phase; Isomerization; ALS |
C6H5NaO (cr) + ( • 552
) (solution) =
(cr) +
(cr)
By formula: C6H5NaO (cr) + (HCl • 552H2O) (solution) = C6H6O (cr) + ClNa (cr)
Quantity | Value | Units | Method | Reference | Comment |
---|---|---|---|---|---|
ΔrH° | -78.0 ± 5.7 | kJ/mol | RSC | Leal, Pires de Matos, et al., 1991 | MS |
By formula: C6H6O + C14H22O = C10H14O + C10H14O
Quantity | Value | Units | Method | Reference | Comment |
---|---|---|---|---|---|
ΔrH° | 0.08 ± 0.71 | kJ/mol | Eqk | Pil'shchikov, Nesterova, et al., 1981 | liquid phase; ALS |
By formula: C6H6O + C14H22O = C10H14O + C10H14O
Quantity | Value | Units | Method | Reference | Comment |
---|---|---|---|---|---|
ΔrH° | -0. ± 4. | kJ/mol | Eqk | Pil'shchikov, Nesterova, et al., 1981 | liquid phase; ALS |
By formula: (Li+ • C6H6O) + C6H6O = (Li+ • 2C6H6O)
Quantity | Value | Units | Method | Reference | Comment |
---|---|---|---|---|---|
ΔrH° | 115. ± 3. | kJ/mol | CIDT | Amunugama and Rodgers, 2002 | RCD |
By formula: (Na+ • C6H6O) + C6H6O = (Na+ • 2C6H6O)
Quantity | Value | Units | Method | Reference | Comment |
---|---|---|---|---|---|
ΔrH° | 82. ± 3. | kJ/mol | CIDT | Amunugama and Rodgers, 2002 | RCD |
By formula: (Cs+ • C6H6O) + C6H6O = (Cs+ • 2C6H6O)
Quantity | Value | Units | Method | Reference | Comment |
---|---|---|---|---|---|
ΔrH° | 61. ± 3. | kJ/mol | CIDT | Amunugama and Rodgers, 2002 | RCD |
By formula: (Rb+ • C6H6O) + C6H6O = (Rb+ • 2C6H6O)
Quantity | Value | Units | Method | Reference | Comment |
---|---|---|---|---|---|
ΔrH° | 64. ± 3. | kJ/mol | CIDT | Amunugama and Rodgers, 2002 | RCD |
By formula: (K+ • C6H6O) + C6H6O = (K+ • 2C6H6O)
Quantity | Value | Units | Method | Reference | Comment |
---|---|---|---|---|---|
ΔrH° | 68. ± 3. | kJ/mol | CIDT | Amunugama and Rodgers, 2002 | RCD |
(cr) + C10H11ClZr (cr) = C16H15ClOZr (cr) +
(g)
By formula: C6H6O (cr) + C10H11ClZr (cr) = C16H15ClOZr (cr) + H2 (g)
Quantity | Value | Units | Method | Reference | Comment |
---|---|---|---|---|---|
ΔrH° | -77.7 ± 4.2 | kJ/mol | RSC | Diogo, Simoni, et al., 1993 | MS |
By formula: C6H6O + C14H22O = 2C10H14O
Quantity | Value | Units | Method | Reference | Comment |
---|---|---|---|---|---|
ΔrH° | -12.8 ± 0.54 | kJ/mol | Eqk | Pil'shchikov, Nesterova, et al., 1981 | liquid phase; ALS |
By formula: C6H6O + C14H22O = C10H14O + C10H14O
Quantity | Value | Units | Method | Reference | Comment |
---|---|---|---|---|---|
ΔrH° | 0.0 | kJ/mol | Eqk | Pil'shchikov, Nesterova, et al., 1981 | liquid phase; ALS |
C6H5NaO (cr) + (l) =
(cr) +
(cr)
By formula: C6H5NaO (cr) + H2O (l) = C6H6O (cr) + HNaO (cr)
Quantity | Value | Units | Method | Reference | Comment |
---|---|---|---|---|---|
ΔrH° | 21.4 ± 3.6 | kJ/mol | RSC | Leal, Pires de Matos, et al., 1991 | MS |
By formula: Li+ + C6H6O = (Li+ • C6H6O)
Quantity | Value | Units | Method | Reference | Comment |
---|---|---|---|---|---|
ΔrH° | 178. ± 17. | kJ/mol | CIDT | Amunugama and Rodgers, 2002 | RCD |
By formula: Cs+ + C6H6O = (Cs+ • C6H6O)
Quantity | Value | Units | Method | Reference | Comment |
---|---|---|---|---|---|
ΔrH° | 66. ± 3. | kJ/mol | CIDT | Amunugama and Rodgers, 2002 | RCD |
By formula: Rb+ + C6H6O = (Rb+ • C6H6O)
Quantity | Value | Units | Method | Reference | Comment |
---|---|---|---|---|---|
ΔrH° | 69. ± 3. | kJ/mol | CIDT | Amunugama and Rodgers, 2002 | RCD |
By formula: K+ + C6H6O = (K+ • C6H6O)
Quantity | Value | Units | Method | Reference | Comment |
---|---|---|---|---|---|
ΔrH° | 74. ± 3. | kJ/mol | CIDT | Amunugama and Rodgers, 2002 | RCD |
By formula: C10H14O = C4H8 + C6H6O
Quantity | Value | Units | Method | Reference | Comment |
---|---|---|---|---|---|
ΔrH° | 77.8 | kJ/mol | Cm | Kukui, Potolovskii, et al., 1973 | liquid phase; ALS |
By formula: C10H14O = C4H8 + C6H6O
Quantity | Value | Units | Method | Reference | Comment |
---|---|---|---|---|---|
ΔrH° | 82.8 | kJ/mol | Cm | Kukui, Potolovskii, et al., 1973 | liquid phase; ALS |
By formula: C10H14O = C6H6O + C4H8
Quantity | Value | Units | Method | Reference | Comment |
---|---|---|---|---|---|
ΔrH° | 71.0 ± 2.1 | kJ/mol | Eqk | Verevkin, 1982 | gas phase; ALS |

Henry's Law data

Data compiled by: Rolf Sander
Henry's Law constant (water solution)
kH(T) = k°H exp(d(ln(kH))/d(1/T) ((1/T) - 1/(298.15 K)))
k°H = Henry's law constant for solubility in water at 298.15 K (mol/(kg*bar))
d(ln(kH))/d(1/T) = Temperature dependence constant (K)
k°H (mol/(kg*bar)) | d(ln(kH))/d(1/T) (K) | Method | Reference | Comment |
---|---|---|---|---|
3000. | X | N/A | ||
0.078 | X | Howe, Mullins, et al., 1987 | Value given here as quoted by missing citation. | |
190. | 3600. | X | N/A | |
3000. | X | N/A | Value given here as quoted by missing citation. | |
1900. | 7300. | X | N/A | |
2900. | 6800. | M | N/A | It is assumed here that the thermodynamic data in missing citation refers to the units [mol/dm3] and [atm] as standard states. |
490. | R | N/A |

Kovats' RI, non-polar column, isothermal

Column type | Active phase | Temperature (C) | I | Reference | Comment |
---|---|---|---|---|---|
Capillary | SE-30 | 100. | 950. | Berezkin, Popova, et al., 1997 | 30. m/0.25 mm/0.5 μm, He |
Capillary | OV-1 | 150. | 950. | Zhang, Chen, et al., 1997 | 25. m/0.2 mm/0.33 μm, N2 |
Capillary | OV-1 | 150. | 950. | Zhang, Chen, et al., 1997 | 25. m/0.2 mm/0.33 μm, N2 |
Capillary | OV-1 | 150. | 950. | Zhang, Chen, et al., 1997 | 25. m/0.2 mm/0.33 μm, N2 |
Capillary | OV-1 | 160. | 974. | Zhang, Chen, et al., 1997 | 25. m/0.2 mm/0.33 μm, N2 |
Packed | OV-101 | 100. | 950.2 | Righezza, Hassani, et al., 1996 | N2, Chromosorb G HP; Column length: 5. m |
Packed | OV-101 | 110. | 950.7 | Righezza, Hassani, et al., 1996 | N2, Chromosorb G HP; Column length: 5. m |
Packed | OV-101 | 80. | 944.7 | Righezza, Hassani, et al., 1996 | N2, Chromosorb G HP; Column length: 5. m |
Packed | OV-101 | 90. | 945.2 | Righezza, Hassani, et al., 1996 | N2, Chromosorb G HP; Column length: 5. m |
Packed | OV-101 | 120. | 952.5 | Hassani and Meklati, 1992 | N2, Chromosorb G HP; Column length: 5. m |
Capillary | HP-1 | 60. | 943. | Zhang, Li, et al., 1992 | N2; Column length: 25. m; Column diameter: 0.20 mm |
Capillary | HP-1 | 60. | 944. | Zhang, Li, et al., 1992 | N2; Column length: 25. m; Column diameter: 0.20 mm |
Capillary | HP-1 | 100. | 952. | Zhang, Li, et al., 1992 | N2; Column length: 25. m; Column diameter: 0.20 mm |
Capillary | HP-1 | 100. | 954. | Zhang, Li, et al., 1992 | N2; Column length: 25. m; Column diameter: 0.20 mm |
Capillary | SE-30 | 160. | 929. | Evans and Haken, 1989 | Column length: 25. m; Column diameter: 0.32 mm |
Capillary | SE-30 | 160. | 964. | Evans and Haken, 1989 | Column length: 25. m; Column diameter: 0.32 mm |
Capillary | PS-255 | 150. | 952. | Engewald, Billing, et al., 1988 | 50. m/0.30 mm/0.25 μm |
Capillary | SE-30 | 180. | 953. | Shakirov, Tsypysheva, et al., 1988 | Column length: 20. m; Column diameter: 0.2 mm |
Capillary | SE-30 | 160. | 964. | Korhonen and Knuutinen, 1984 | N2; Column length: 25. m; Column diameter: 0.3 mm |
Capillary | SE-30 | 180. | 924. | Korhonen and Knuutinen, 1984 | N2; Column length: 25. m; Column diameter: 0.3 mm |
Capillary | SE-30 | 140. | 943. | Korhonen, 1984 | |
Capillary | SE-30 | 160. | 929. | Korhonen, 1984 | |
Capillary | SE-30 | 180. | 932. | Korhonen, 1984 | |
Packed | SE-30 | 150. | 965. | Tiess, 1984 | Ar, Gas Chrom Q (80-100 mesh); Column length: 3. m |
Packed | SE-30 | 100. | 926. | Winskowski, 1983 | Gaschrom Q; Column length: 2. m |
Packed | OV-101 | 130. | 951. | Zygmunt, Wardencki, et al., 1983 | Ar, Gas-Chrom Q; Column length: 1.5 m |
Packed | OV-101 | 130. | 954. | Zygmunt, Wardencki, et al., 1983 | Ar, Gas-Chrom Q; Column length: 1.5 m |
Packed | Apiezon L | 180. | 955. | Vernon and Edwards, 1975 | N2, Celite; Column length: 1. m |
Capillary | Apiezon L | 120. | 966. | Agr, Tesaric, et al., 1973 | |
Capillary | Squalane | 120. | 942. | Agr, Tesaric, et al., 1973 | |
Capillary | Squalane | 86. | 933. | Agr, Tesaric, et al., 1973 | |
Packed | SE-30 | 204. | 950. | Mitchell and Vernon, 1972 | |
Packed | Apiezon L | 204. | 960. | Mitchell and Vernon, 1972 | |
Packed | SE-52 | 204. | 961. | Mitchell and Vernon, 1972 | |
Packed | SE-30 | 150. | 964. | Tibor and Anna, 1971 | N2, Chromosorb W-AW; Column length: 2. m |
Packed | SE-30 | 170. | 973. | Tibor and Anna, 1971 | N2, Chromosorb W-AW; Column length: 2. m |
Packed | Apiezon L | 100. | 923. | Brown, Chapman, et al., 1968 | N2, DCMS-treated Chromosorb W; Column length: 2.3 m |
Packed | DC-200 | 120. | 950. | Reymond, Mueggler-Chavan, et al., 1966 | Celite; Column length: 4. m |
Packed | SE-30 | 180. | 970. | Viani, Müggler-Chavan, et al., 1965 | He, Chromosorb P; Column length: 6. m |

Kovats' RI, non-polar column, temperature ramp

Column type | Active phase | I | Reference | Comment |
---|---|---|---|---|
Capillary | SE-30 | 967. | Medvedovskaya, Tikhomirova, et al., 1997 | 7. K/min; Tstart: 50. C; Tend: 320. C |

Kovats' RI, polar column, isothermal

Column type | Active phase | Temperature (C) | I | Reference | Comment |
---|---|---|---|---|---|
Capillary | FFAP | 160. | 2000. | Evans and Haken, 1989 | Column length: 25. m; Column diameter: 0.35 mm |
Capillary | FFAP | 160. | 2000. | Korhonen, 1984 | |
Capillary | FFAP | 180. | 1971. | Korhonen, 1984 | |
Capillary | FFAP | 200. | 1957. | Korhonen, 1984 | |
Packed | PEG-20M | 200. | 1947.0 | Still and Whitehead, 1977 | N2, Chromosorb G; Column length: 3. m |
Packed | PEG-20M | 200. | 1947.0 | Still and Whitehead, 1977 | N2, Chromosorb G; Column length: 3. m |
Packed | PEG-2000 | 200. | 2030. | Anderson, Jurel, et al., 1973 | He, Celite 545 (44-60 mesh); Column length: 3. m |
Packed | PEG-20M | 170. | 2037. | Tibor and Anna, 1971 | N2, Chromosorb W-AW; Column length: 2. m |

Van Den Dool and Kratz RI, non-polar column, temperature ramp

Column type | Active phase | I | Reference | Comment |
---|---|---|---|---|
Capillary | RTX-5 | 981.4 | Ádámová, Orinák, et al., 2005 | 30. m/0.25 mm/0.25 μm, N2, 40. C @ 2. min, 5. K/min, 300. C @ 10. min |
Capillary | CP-Sil 8CB-MS | 992. | Hierro, de la Hoz, et al., 2004 | 60. m/0.25 mm/0.25 μm, 40. C @ 2. min, 4. K/min, 280. C @ 5. min |
Capillary | HP-5MS | 981. | Lalel, Singh, et al., 2003 | 60. m/0.25 mm/0.25 μm, He, 40. C @ 1. min, 3. K/min, 310. C @ 20. min |
Capillary | DB-1 | 959.6 | Sun and Stremple, 2003 | 30. m/0.25 mm/0.25 μm, He, 3. K/min; Tstart: 40. C; Tend: 325. C |
Capillary | DB-5 | 978.8 | Xu, van Stee, et al., 2003 | 30. m/0.25 mm/1. μm, He, 2.5 K/min; Tstart: 50. C; Tend: 200. C |
Capillary | CP Sil 5 CB | 956. | Pino, Marbot, et al., 2002 | 30. m/0.25 mm/0.25 μm, H2, 60. C @ 10. min, 2. K/min, 280. C @ 40. min |
Capillary | DB-1 | 961. | Kim, 2001 | 60. m/0.32 mm/1. μm, He, 40. C @ 5. min, 2. K/min; Tend: 220. C |
Capillary | SPB-Sulfur | 954.1 | de Lacy Costello, Evans, et al., 2001 | 30. m/0.32 mm/4. μm, 40. C @ 12.5 min, 4. K/min; Tend: 200. C |
Capillary | SE-54 | 978.16 | Yin, Xiu, et al., 2001 | 35. C @ 3. min, 4. K/min, 230. C @ 10. min; Column length: 25. m; Column diameter: 0.31 mm |
Capillary | SE-54 | 979.62 | Yin, Xiu, et al., 2001 | 35. C @ 3. min, 4. K/min, 230. C @ 10. min; Column length: 25. m; Column diameter: 0.31 mm |
Capillary | CP Sil 8 CB | 977. | Chevance and Farmer, 1999 | 60. C @ 5. min, 4. K/min, 220. C @ 30. min; Column length: 50. m; Column diameter: 0.32 mm |
Capillary | DB-1 | 955.0 | Helmig, Klinger, et al., 1999 | 60. m/0.32 mm/1. μm, -50. C @ 2. min, 6. K/min; Tend: 175. C |
Capillary | SPB-5 | 977. | Verdier-Metz., Coulon, et al., 1998 | 60. m/0.32 mm/1. μm, He, 40. C @ 5. min, 3. K/min, 200. C @ 2. min |
Capillary | DB-1 | 954. | DeMilo, Lee, et al., 1996 | 30. m/0.248 mm/0.25 μm, He, 50. C @ 5. min, 5. K/min; Tend: 250. C |
Capillary | DB-1 | 959. | DeMilo, Lee, et al., 1996 | 30. m/0.248 mm/0.25 μm, He, 50. C @ 5. min, 5. K/min; Tend: 250. C |
Capillary | OV-1 | 958.5 | Gautzsch and Zinn, 1996 | 8. K/min; Tstart: 35. C; Tend: 300. C |
Capillary | DB-1 | 954.9 | Helmig, Pollock, et al., 1996 | 30. m/0.25 mm/1. μm, 6. K/min; Tstart: -50. C; Tend: 180. C |
Capillary | DB-5 | 979.9 | Helmig, Pollock, et al., 1996 | 60. m/0.33 mm/0.25 μm, 6. K/min; Tstart: -50. C; Tend: 180. C |
Capillary | DB-1 | 959. | Coen, Engel, et al., 1995 | 30. m/0.32 mm/0.25 μm, N2, 3. K/min; Tstart: 150. C; Tend: 280. C |
Capillary | DB-1 | 957. | Coen, Engel, et al., 1995 | 30. m/0.32 mm/0.25 μm, N2, 3. K/min; Tstart: 150. C; Tend: 280. C |
Capillary | DB-1 | 975. | Gerbino and Castello, 1995 | 30. m/0.235 mm/0.25 μm, N2, 50. C @ 0. min, 10. K/min |
Capillary | DB-1 | 978. | Gerbino and Castello, 1995 | 30. m/0.235 mm/0.25 μm, N2, 50. C @ 0. min, 5. K/min |
Capillary | SPB-1 | 959. | Lee, DeMilo, et al., 1995 | 30. m/0.25 mm/0.25 μm, He, 50. C @ 5. min, 5. K/min; Tend: 250. C |
Capillary | OV-101 | 947.6 | Ferchichi and Messadi, 1994 | 4. K/min; Column length: 25. m; Column diameter: 0.2 mm; Tstart: 30. C; Tend: 250. C |
Capillary | OV-101 | 965.4 | Ferchichi and Messadi, 1994 | 4. K/min; Column length: 25. m; Column diameter: 0.2 mm; Tstart: 30. C; Tend: 250. C |
Capillary | DB-1 | 952. | Kaiser and Siegl, 1994 | 60. m/0.32 mm/1. μm, -50. C @ 4. min, 6. K/min; Tend: 180. C |
Capillary | DB-1 | 969. | Wu, Kuo, et al., 1991 | 50. m/0.32 mm/1.05 μm, He, 2. K/min, 260. C @ 40. min; Tstart: 40. C |
Capillary | SE-54 | 980.8 | Shapi and Hesso, 1990 | 25. m/0.32 mm/0.15 μm, He, 40. C @ 1. min, 5. K/min, 280. C @ 15. min |
Capillary | SE-54 | 980.8 | Shapi and Hesso, 1990 | 25. m/0.32 mm/0.15 μm, He, 40. C @ 1. min, 5. K/min, 280. C @ 15. min |
Capillary | HP-1 | 983. | Tang, Zhang, et al., 1990 | 50. m/0.32 mm/1.05 μm, He, 2. K/min, 230. C @ 40. min; Tstart: 40. C |
Capillary | RSL-150 | 962. | Sagrero-Nieves, de Pooter, et al., 1989 | 30. m/0.53 mm/1.2 μm, He, 3. K/min; Tstart: 30. C; Tend: 220. C |
Capillary | BP-1 | 966. | Tan, Wilkins, et al., 1989 | H2, 40. C @ 2. min, 4. K/min, 240. C @ 75. min; Column length: 12. m |
Packed | SE-30 | 962. | Peng, Ding, et al., 1988 | He, Supelcoport and Chromosorb, 40. C @ 4. min, 10. K/min, 250. C @ 60. min; Column length: 3.05 m |
Capillary | DB-5 | 998. | Rostad and Pereira, 1986 | 30. m/0.26 mm/0.25 μm, He, 50. C @ 4. min, 6. K/min, 300. C @ 20. min |
Packed | SE-30 | 962. | Buchman, Cao, et al., 1984 | He, Chromosorb AW, 40. C @ 10. min, 10. K/min, 210. C @ 30. min; Column length: 3.05 m |
Capillary | SE-30 | 942. | Korhonen and Knuutinen, 1984 | N2, 10. K/min; Column length: 25. m; Column diameter: 0.3 mm; Tstart: 100. C |
Capillary | SE-30 | 933. | Korhonen and Knuutinen, 1984 | N2, 14. K/min; Column length: 25. m; Column diameter: 0.3 mm; Tstart: 100. C |
Capillary | SE-30 | 933. | Korhonen and Knuutinen, 1984 | N2, 6. K/min; Column length: 25. m; Column diameter: 0.3 mm; Tstart: 100. C |
Capillary | SE-30 | 945. | Korhonen, 1984 | 10. K/min; Tstart: 100. C |
Capillary | SE-30 | 944. | Korhonen, 1984 | 2. K/min; Tstart: 100. C |
Capillary | SE-30 | 946. | Korhonen, 1984 | 6. K/min; Tstart: 100. C |

Van Den Dool and Kratz RI, non-polar column, custom temperature program

Column type | Active phase | I | Reference | Comment |
---|---|---|---|---|
Capillary | DB-5MS | 992. | Varlet, Serot, et al., 2007 | 30. m/0.32 mm/0.5 μm, He; Program: 70C => 5C/min => 85C(1min) => 3C/min => 165C => 10C/min => 280C(3min) |
Capillary | VF-5MS | 1004.1 | Mjøs, Meier, et al., 2006 | 50. m/0.25 mm/0.25 μm, He; Program: 60C(2min) => 30C/min => 100C => 1C/min => |
Capillary | VF-5MS | 995.5 | Mjøs, Meier, et al., 2006 | 50. m/0.25 mm/0.25 μm, He; Program: 60C(2min) => 30C/min => 100C => 2C/min => |
Capillary | VF-5MS | 986.8 | Mjøs, Meier, et al., 2006 | 50. m/0.25 mm/0.25 μm, He; Program: 60C(2min) => 30C/min => 100C => 4C/min => |
Capillary | DB-5MS | 992. | Varlet V., Knockaert C., et al., 2006 | 30. m/0.32 mm/0.5 μm, He; Program: 70C(1min) => 3C/min => 80C(1min) => 5C/min => 150C => 10C/min => 280C (4min) |
Capillary | DB-5MS | 992. | Varlet V., Knockaert C., et al., 2006 | 30. m/0.32 mm/0.5 μm, He; Program: 70C(1min) => 3C/min => 80C(1min) => 5C/min => 150C => 10C/min => 280C (4min) |
Capillary | DB-1 | 955. | Place, Imhof, et al., 2003 | 60. m/0.32 mm/1. μm, He; Program: 35C(5min) => 10C/min => 45C (5min) => 5C/min => 250C (10min) |
Capillary | DB-1 | 953. | Whetstine, Parker, et al., 2003 | 3. m/0.32 mm/0.3 μm, He; Program: -20C(6min) => 8C/min =60C => 6C/min => 220C(5min) |
Capillary | 5 % Phenyl methyl siloxane | 980. | Yasuhara, Shiraishi, et al., 1997 | 25. m/0.31 mm/0.52 μm, He; Program: 50C(2min) => (20C/min) => 120C => (7C/min) => 310C(10min) |
Capillary | Methyl Silicone | 962. | Peng, Yang, et al., 1991 | Program: not specified |

Van Den Dool and Kratz RI, polar column, temperature ramp

Column type | Active phase | I | Reference | Comment |
---|---|---|---|---|
Capillary | DB-FFAP | 2008. | Jarunrattanasri, Theerakulkait, et al., 2007 | 30. m/0.25 mm/0.5 μm, He, 35. C @ 5. min, 4. K/min, 225. C @ 30. min |
Capillary | DB-Wax | 2008. | Pozo-Bayon M.A., Ruiz-Rodriguez A., et al., 2007 | 30. m/0.25 mm/0.5 μm, He, 40. C @ 5. min, 4. K/min, 250. C @ 15. min |
Capillary | DB-Wax | 1992. | Osorio, Alarcon, et al., 2006 | 30. m/0.25 mm/0.25 μm, He, 50. C @ 4. min, 4. K/min, 220. C @ 20. min |
Capillary | Supelcowax-10 | 1962. | Chung, Fung, et al., 2005 | 60. m/0.25 mm/0.25 μm, 35. C @ 5. min, 6. K/min, 195. C @ 60. min |
Capillary | Stabilwax | 2019. | Cros, Lignot, et al., 2005 | 60. m/0.25 mm/0.25 μm, He, 40. C @ 5. min, 3. K/min, 240. C @ 10. min |
Capillary | Innowax | 2028. | Lee, Lee, et al., 2005 | 50. m/0.25 mm/0.25 μm, He, 50. C @ 3. min, 2. K/min, 220. C @ 20. min |
Capillary | OV-351 | 1956. | Bonvehi and Coll, 2003 | 50. m/0.32 mm/0.2 μm, He, 5. K/min; Tstart: 60. C; Tend: 220. C |
Capillary | DB-Wax | 1987. | Chyau, Ko, et al., 2003 | 60. m/0.25 mm/0.25 μm, He, 2. K/min, 210. C @ 40. min; Tstart: 40. C |
Capillary | Stabilwax | 2019. | Cros, Vandanjon, et al., 2003 | 60. m/0.25 mm/0.25 μm, He, 40. C @ 5. min, 3. K/min, 240. C @ 10. min |
Capillary | Supelcowax-10 | 2014. | Chung, Yung, et al., 2002 | 60. m/0.25 mm/0.25 μm, He, 35. C @ 5. min, 2. K/min, 195. C @ 90. min |
Capillary | HP-Innowax | 2032. | Adamiec, Rossner, et al., 2001 | 30. m/0.25 mm/0.25 μm, N2, 5. K/min; Tstart: 60. C; Tend: 220. C |
Capillary | HP-Innowax | 2032. | Adamiec, Rossner, et al., 2001 | 30. m/0.25 mm/0.25 μm, N2, 5. K/min; Tstart: 60. C; Tend: 220. C |
Capillary | Supelcowax-10 | 2014. | Chung, Yung, et al., 2001 | 60. m/0.25 mm/0.25 μm, He, 35. C @ 5. min, 2. K/min, 195. C @ 90. min |
Capillary | DB-Wax | 2004. | Kim, 2001 | 60. m/0.25 mm/0.25 μm, He, 40. C @ 5. min, 2. K/min, 200. C @ 30. min |
Capillary | DB-Wax | 2006. | Shimoda, Yoshimura, et al., 2001 | 60. m/0.25 mm/0.25 μm, He, 2. K/min, 230. C @ 60. min; Tstart: 50. C |
Capillary | DB-Wax | 1987. | Wirth, Guo, et al., 2001 | 30. m/0.32 mm/0.5 μm, He, 60. C @ 3. min, 3. K/min, 245. C @ 20. min |
Capillary | DB-Wax | 2000. | Bureau, Baumes, et al., 2000 | 30. m/0.32 mm/0.5 μm, He, 60. C @ 3. min, 3. K/min, 245. C @ 20. min |
Capillary | Supelcowax-10 | 2015. | Chung, 2000 | 60. m/0.25 mm/0.25 μm, He, 2. K/min, 195. C @ 90. min; Tstart: 35. C |
Capillary | CP-Wax 52CB | 2000. | Chevance and Farmer, 1999 | 60. C @ 5. min, 4. K/min, 220. C @ 30. min; Column length: 50. m; Column diameter: 0.32 mm |
Capillary | CP-Wax 52CB | 2000. | Chevance and Farmer, 1999, 2 | 60. C @ 5. min, 4. K/min, 220. C @ 30. min; Column length: 50. m; Column diameter: 0.32 mm |
Capillary | CP-Wax 52CB | 2000. | Chevance and Farmer, 1999, 2 | 40. C @ 5. min, 4. K/min, 220. C @ 30. min; Column length: 50. m; Column diameter: 0.32 mm |
Capillary | Supelcowax-10 | 2015. | Chung, 1999 | 60. m/0.25 mm/0.25 μm, He, 35. C @ 5. min, 2. K/min, 195. C @ 90. min |
Capillary | Supelcowax-10 | 2015. | Chung, 1999, 2 | 60. m/0.25 mm/0.25 μm, He, 35. C @ 5. min, 2. K/min, 195. C @ 90. min |
Capillary | DB-Wax | 1956. | Ollé, Baumes, et al., 1998 | 30. m/0.32 mm/0.5 μm, 40. C @ 3. min, 3. K/min, 245. C @ 20. min |
Capillary | DB-Wax | 2010. | Coen, Engel, et al., 1995 | 30. m/0.32 mm/0.5 μm, He, 2. K/min; Tstart: 50. C; Tend: 230. C |
Capillary | DB-Wax | 2023.76 | Gerbino and Castello, 1995 | 30. m/0.235 mm/0.5 μm, N2, 10. K/min; Tstart: 100. C |
Capillary | DB-Wax | 2018.23 | Gerbino and Castello, 1995 | 30. m/0.235 mm/0.5 μm, N2, 5. K/min; Tstart: 100. C |
Capillary | DB-Wax | 2024.04 | Gerbino and Castello, 1995 | 30. m/0.235 mm/0.5 μm, N2, 10. K/min; Tstart: 50. C |
Capillary | DB-Wax | 2015.92 | Gerbino and Castello, 1995 | 30. m/0.235 mm/0.5 μm, N2, 5. K/min; Tstart: 50. C |
Capillary | DB-Wax | 2004. | Shiratsuchi, Shimoda, et al., 1994 | 60. m/0.25 mm/0.25 μm, He, 2. K/min, 230. C @ 60. min; Tstart: 50. C |
Capillary | DB-Wax | 2015. | Sumitani, Suekane, et al., 1994 | He, 40. C @ 5. min, 3. K/min; Column length: 60. m; Column diameter: 0.25 mm; Tend: 200. C |
Capillary | Supelcowax-10 | 2008. | Chung and Cadwallader, 1993 | 60. m/0.25 mm/0.25 μm, He, 40. C @ 5. min, 2. K/min, 195. C @ 40. min |
Capillary | DB-Wax | 1996. | Umano, Hagi, et al., 1992 | He, 40. C @ 10. min, 2. K/min; Column length: 30. m; Column diameter: 0.25 mm; Tend: 200. C |
Capillary | DB-Wax | 1965. | Humpf and Schreier, 1991 | 30. m/0.25 mm/0.25 μm, He, 50. C @ 3. min, 4. K/min, 220. C @ 20. min |
Capillary | DB-Wax | 1978. | Krammer, Winterhalter, et al., 1991 | 30. m/0.25 mm/0.25 μm, He, 50. C @ 3. min, 4. K/min; Tend: 240. C |
Capillary | CP-Wax 58CB | 1977. | Pabst, Barron, et al., 1991 | 30. m/0.25 mm/0.22 μm, He, 3. K/min; Tstart: 40. C; Tend: 220. C |
Capillary | DB-Wax | 1965. | Suárez, Duque, et al., 1991 | 30. m/0.259 mm/0.25 μm, He, 50. C @ 3. min, 4. K/min; Tend: 240. C |
Capillary | DB-Wax | 1973. | Suárez, Duque, et al., 1991 | 30. m/0.259 mm/0.25 μm, He, 50. C @ 3. min, 4. K/min; Tend: 240. C |
Capillary | DB-Wax | 1965. | Suárez, Duque, et al., 1991 | 30. m/0.259 mm/0.25 μm, He, 50. C @ 3. min, 4. K/min; Tend: 240. C |
Capillary | DB-Wax | 1973. | Suárez, Duque, et al., 1991 | 30. m/0.259 mm/0.25 μm, He, 50. C @ 3. min, 4. K/min; Tend: 240. C |
Capillary | DB-Wax | 1973. | Frohlich and Schreier, 1990 | 30. m/0.32 mm/0.25 μm, He, 40. C @ 3. min, 5. K/min; Tend: 220. C |
Capillary | Carbowax 20M | 1975. | Schwab, Mahr, et al., 1989 | 30. m/0.25 mm/0.25 μm, He, 40. C @ 3. min, 4. K/min; Tend: 240. C |
Capillary | Supelcowax-10 | 2012. | Tanchotikul and Hsieh, 1989 | 60. m/0.25 mm/0.25 μm, 40. C @ 5. min, 2. K/min, 175. C @ 20. min |
Capillary | Supelcowax-10 | 2014. | Tanchotikul and Hsieh, 1989 | 60. m/0.25 mm/0.25 μm, 40. C @ 5. min, 2. K/min, 175. C @ 20. min |
Capillary | CP-WAX 57CB | 1997. | Baltes and Mevissen, 1988 | He, 50. C @ 5. min, 2. K/min; Column length: 50. m; Column diameter: 0.24 mm; Tend: 210. C |
Capillary | PEG-20M | 1984.5 | Wang and Sun, 1987 | 25. m/0.26 mm/0.3 μm, 2. K/min; Tstart: 100. C; Tend: 200. C |
Capillary | PEG-20M | 1983.4 | Wang and Sun, 1987 | 25. m/0.26 mm/0.3 μm, 2. K/min; Tstart: 60. C; Tend: 200. C |
Packed | Carbowax 20M | 1967. | Buchman, Cao, et al., 1984 | He, Supelcoport, 40. C @ 10. min, 10. K/min, 210. C @ 30. min; Column length: 3.05 m |
Capillary | FFAP | 1962. | Korhonen, 1984 | 10. K/min; Tstart: 100. C |
Capillary | FFAP | 1950. | Korhonen, 1984 | 2. K/min; Tstart: 100. C |

Van Den Dool and Kratz RI, polar column, custom temperature program

Column type | Active phase | I | Reference | Comment |
---|---|---|---|---|
Capillary | Stabilwax | 2026. | Natali N., Chinnici F., et al., 2006 | 30. m/0.25 mm/0.25 μm, He; Program: 40C => 3C/min => 100C => 5C/min => 240C(10min) |
Capillary | CP-Wax 52CB | 2015. | Verzera, Ziino, et al., 2004 | 60. m/0.25 mm/0.25 μm, He; Program: 45C(5min) => 10C/min => 80C => 2C/min => 240C |
Capillary | DB-Wax | 1996. | Pennarun, Prost, et al., 2003 | 30. m/0.32 mm/0.5 μm, He; Program: 50C => 6C/min => 70C => 4C/min => 150C => 10C/min => 250C |
Capillary | DB-Wax | 1996. | Pennarun, Prost, et al., 2002 | 30. m/0.32 mm/0.5 μm, He; Program: 50C => 6C/min => 70C => 4C/min => 150C => 10C/min => 250C |
Capillary | DB-Wax | 1984. | Cantergiani, Brevard, et al., 2001 | 30. m/0.25 mm/0.25 μm; Program: 20C(30s) => fast => 60C => 4C/min => 220C (20min) |
Capillary | Supelcowax-10 | 2003. | Baek and Cadwallader, 1996 | 60. m/0.25 mm/0.25 μm; Program: 40C => (6C/min) => 80C(6min) => (15C/min) => 200C(10min) |
Capillary | FFAP | 2028. | Yasuhara, 1987 | 50. m/0.25 mm/0.25 μm, He; Program: 20C (5min) => 2C/min => 70C => 4C/min => 210C |
Capillary | Carbowax 20M | 1990. | Whitfield, Shea, et al., 1981 | Column length: 150. m; Column diameter: 0.75 mm; Program: not specified |

Normal alkane RI, non-polar column, isothermal

Column type | Active phase | Temperature (C) | I | Reference | Comment |
---|---|---|---|---|---|
Packed | Apieson L | 140. | 956. | Hedin, Minyard, et al., 1967 | Nitrogen, Chromosorb W HMDS (60-80 mesh); Column length: 1.8 m |

Normal alkane RI, non-polar column, temperature ramp

Column type | Active phase | I | Reference | Comment |
---|---|---|---|---|
Capillary | HP-5 MS | 989. | Wanakhachornkrai and Lertsiri, 9999 | 30. m/0.25 mm/0.25 μm, Helium, 15. K/min; Tstart: 45. C; Tend: 280. C |
Capillary | Optima-5 MS | 983. | Goeminne, Vandendriessche, et al., 2012 | 30. m/0.25 mm/0.25 μm, Helium, 35. C @ 3. min, 10. K/min, 250. C @ 5. min |
Capillary | TR-1 | 962. | Gruzdev, Kuzivanov, et al., 2012 | 30. m/0.32 mm/0.25 μm, Helium, 5. K/min; Tstart: 50. C; Tend: 300. C |
Capillary | TR-1 | 962. | Gruzdev, Kuzivanov, et al., 2012, 2 | 30. m/0.32 mm/0.25 μm, Helium, 5. K/min; Tstart: 50. C; Tend: 300. C |
Capillary | HP-5 MS | 994. | Kotowska, Zalikowski, et al., 2012 | 30. m/0.25 mm/0.25 μm, Helium, 35. C @ 5. min, 3. K/min, 300. C @ 15. min |
Capillary | HP-5 MS | 984. | Nawrath, Mgode, et al., 2012 | 30. m/0.25 mm/0.25 μm, Helium, 50. C @ 5. min, 5. K/min; Tend: 320. C |
Capillary | VF-5 MS | 987. | Leffingwell and Alford, 2011 | 60. m/0.32 mm/0.25 μm, Helium, 2. K/min, 260. C @ 28. min; Tstart: 30. C |
Capillary | VF-5 MS | 989. | Leffingwell and Alford, 2011 | 60. m/0.32 mm/0.25 μm, Helium, 2. K/min, 260. C @ 28. min; Tstart: 30. C |
Capillary | HP-5 | 981. | Piyachaiseth, Jirapakkul, et al., 2011 | 60. m/0.25 mm/0.25 μm, Helium, 35. C @ 1. min, 10. K/min, 220. C @ 15. min |
Capillary | DB-5 MS | 994. | Majcher, Lawrowski, et al., 2010 | 25. m/0.20 mm/0.33 μm, Helium, 40. C @ 1. min, 10. K/min; Tend: 250. C |
Capillary | HP-5 MS | 978. | Radulovic, Blagojevic, et al., 2010 | 30. m/0.25 mm/0.25 μm, Helium, 5. K/min, 290. C @ 10. min; Tstart: 70. C |
Capillary | HP-5 MS | 972. | Radulovic, Dordevic, et al., 2010 | 30. m/0.25 mm/0.25 μm, Helium, 5. K/min, 290. C @ 10. min; Tstart: 70. C |
Capillary | ZB-5 | 986. | Harrison and Priest, 2009 | 30. m/0.25 mm/0.25 μm, Helium, 40. C @ 1. min, 6. K/min, 280. C @ 9. min |
Capillary | RTX-5 | 979. | Pham, Schilling, et al., 2008 | 30. m/0.25 mm/0.25 μm, He, 40. C @ 5. min, 20. K/min; Tend: 250. C |
Capillary | HP-5 MS | 968. | Bozi, Czagany, et al., 2007 | 30. m/0.25 mm/0.25 μm, Helium, 50. C @ 1. min, 10. K/min, 300. C @ 4. min |
Capillary | Elite-5MS | 978. | Tava, Pecetti, et al., 2007 | 30. m/0.32 mm/0.5 μm, He, 40. C @ 5. min, 4. K/min, 280. C @ 10. min |
Capillary | SPB-5 | 983. | Vasta, Ratel, et al., 2007 | 60. m/0.32 mm/1. μm, 40. C @ 5. min, 3. K/min, 230. C @ 5. min |
Capillary | DB-5 | 980. | Xu, Fan, et al., 2007 | 30. m/0.32 mm/0.25 μm, He, 40. C @ 2. min, 4. K/min, 250. C @ 5. min |
Capillary | HP-1 | 951. | Castel, Fernandez, et al., 2006 | 50. m/0.2 mm/0.33 μm, He, 60. C @ 4. min, 2. K/min, 250. C @ 30. min |
Capillary | HP-1 | 954. | Castel, Fernandez, et al., 2006 | 50. m/0.2 mm/0.33 μm, He, 60. C @ 4. min, 2. K/min, 250. C @ 30. min |
Capillary | DB-5 | 980. | Fan and Qian, 2006 | 30. m/0.32 mm/1. μm, N2, 40. C @ 2. min, 6. K/min, 230. C @ 15. min |
Capillary | DB-1 | 957. | Lee, Lee, et al., 2005, 2 | 60. m/0.32 mm/0.25 μm, He, 35. C @ 4. min, 2. K/min, 230. C @ 25. min |
Capillary | DB-1 | 963. | Lee, Lee, et al., 2005, 2 | 60. m/0.32 mm/0.25 μm, He, 35. C @ 4. min, 2. K/min, 230. C @ 25. min |
Capillary | MDN-5 | 980. | van Loon, Linssen, et al., 2005 | 60. m/0.25 mm/0.25 μm, He, 40. C @ 4. min, 4. K/min, 270. C @ 5. min |
Capillary | DB-1 | 957. | Park, Lee, et al., 2004 | 60. m/0.32 mm/0.25 μm, He, 35. C @ 4. min, 2. K/min, 230. C @ 25. min |
Capillary | DB-1 | 961. | Park, Lee, et al., 2004 | 60. m/0.32 mm/0.25 μm, He, 35. C @ 4. min, 2. K/min, 230. C @ 25. min |
Capillary | DB-1 | 963. | Park, Lee, et al., 2004 | 60. m/0.32 mm/0.25 μm, He, 35. C @ 4. min, 2. K/min, 230. C @ 25. min |
Capillary | DB-1 | 964. | Park, Lee, et al., 2004 | 60. m/0.32 mm/0.25 μm, He, 35. C @ 4. min, 2. K/min, 230. C @ 25. min |
Capillary | HP-5 | 992. | Zenkevich, Moeder, et al., 2004 | 30. m/0.25 mm/0.25 μm, Helium, 50. C @ 3. min, 3. K/min, 280. C @ 20. min |
Capillary | SPB-5 | 974. | Sebastian, Viallon-Fernandez, et al., 2003 | 60. m/0.32 mm/1.0 μm, Helium, 3. K/min; Tstart: 30. C; Tend: 230. C |
Capillary | HP-5 | 989. | Wanakhachornkrai and Lertsiri, 2003 | 30. m/0.25 mm/0.25 μm, He, 45. C @ 2. min, 15. K/min, 280. C @ 11.4 min |
Capillary | BP-1 | 961. | Hayes R.A., Richardson B.J., et al., 2002 | 25. m/0.2 mm/0.1 μm, He, 40. C @ 5. min, 8. K/min; Tend: 250. C |
Capillary | AT-1 | 986. | Kelling, 2001 | He, 50. C @ 2. min, 10. K/min; Tend: 300. C |
Capillary | SPB-5 | 978. | Poligné, Collignan, et al., 2001 | 60. m/0.32 mm/1. μm, He, 3. K/min; Tstart: 40. C; Tend: 200. C |
Capillary | BP-1 | 951. | Health Safety Executive, 2000 | 50. m/0.22 mm/0.75 μm, He, 5. K/min; Tstart: 50. C; Tend: 200. C |
Capillary | Ultra-2 | 977. | Quiroz, Fuentes-Contreras, et al., 1999 | 40. C @ 4. min, 5. K/min; Column length: 25. m; Column diameter: 0.2 mm; Tend: 300. C |
Capillary | BPX-5 | 986. | D'Arcy, Rintoul, et al., 1997 | 50. m/0.22 mm/0.25 μm, He, 50. C @ 1. min, 3. K/min, 250. C @ 10. min |
Capillary | DB-1 | 973. | Lu, Yu, et al., 1997 | 60. m/0.32 mm/1. μm, He, 40. C @ 2. min, 2. K/min, 280. C @ 40. min |
Capillary | DB-1 | 951. | Robacker and Bartelt, 1997 | 30. m/0.32 mm/0.5 μm, He, 35. C @ 1. min, 10. K/min; Tend: 200. C |
Capillary | DB-1 | 981. | Yu and Ho, 1995 | 60. m/0.25 mm/1. μm, He, 40. C @ 5. min, 2. K/min, 260. C @ 60. min |
Capillary | DB-1 | 964. | Ciccioli, Cecinato, et al., 1992 | 60. m/0.32 mm/1.2 μm, He, 30. C @ 10. min, 3. K/min; Tend: 240. C |
Capillary | DB-1 | 957. | Binder, Benson, et al., 1990 | 4. K/min, 230. C @ 10. min; Column length: 60. m; Column diameter: 0.32 mm; Tstart: 50. C |
Capillary | DB5-30W | 984. | Schwab and Schreier, 1988 | 30. m/0.25 mm/0.25 μm, He, 5. K/min; Tstart: 60. C; Tend: 300. C |
Capillary | SE-54 | 988. | Harland, Cumming, et al., 1986 | He, 50. C @ 2. min, 8. K/min, 250. C @ 12. min; Column length: 25. m; Column diameter: 0.32 mm |
Capillary | DB-1 | 954. | Habu, Flath, et al., 1985 | 3. K/min; Column length: 50. m; Column diameter: 0.32 mm; Tstart: 0. C; Tend: 250. C |
Capillary | DB-1 | 948. | Habu, Flath, et al., 1985 | 3. K/min; Column length: 50. m; Column diameter: 0.32 mm; Tstart: 50. C; Tend: 250. C |
Capillary | OV-101 | 969. | Stern, Flath, et al., 1985 | 50. C @ 0.1 min, 4. K/min, 225. C @ 30. min; Column length: 50. m; Column diameter: 0.32 mm |
Capillary | OV-101 | 953. | Spiteller and Spiteller, 1979 | He, 75. C @ 7. min, 2. K/min; Column length: 25. m; Tend: 280. C |

Normal alkane RI, non-polar column, custom temperature program

Column type | Active phase | I | Reference | Comment |
---|---|---|---|---|
Capillary | HP-5 MS | 982. | Kotowska, Zalikowski, et al., 2012 | 30. m/0.25 mm/0.25 μm, Helium; Program: not specified |
Capillary | SLB-5 MS | 982. | Mondello, 2012 | 30. m/0.25 mm/0.25 μm, Helium; Program: not specified |
Capillary | Polydimethyl siloxane with 5 % Ph groups | 979. | Robinson, Adams, et al., 2012 | Program: not specified |
Capillary | Polydimethyl siloxane with 5 % Ph groups | 995. | Robinson, Adams, et al., 2012 | Program: not specified |
Capillary | RTX-5 MS | 987. | Mebazaa, Mahmoudi, et al., 2009 | 30. m/0.25 mm/0.25 μm, Helium; Program: 50 0C (5 min) 2 0C/min -> 100 0C (5 min) 5 0C/min -> 300 0C |
Capillary | RTX-5 MS | 980. | Mebazaa, Mahmoudi, et al., 2009 | 30. m/0.25 mm/0.25 μm, Helium; Program: not specified |
Capillary | ZB-5 | 983. | de Simon, Estruelas, et al., 2009 | 30. m/0.25 mm/0.25 μm, Helium; Program: 45 0C 3 0C/min -> 230 0C (10 min) 10 0C/min -> 270 0C (21 min) |
Capillary | Nonpolar | 969. | Staples and Zeiger, 2008 | Program: not specified |
Capillary | Nonpolar | 976. | Staples and Zeiger, 2008 | Program: not specified |
Capillary | Nonpolar | 976. | Staples and Zeiger, 2008 | Program: not specified |
Capillary | Nonpolar | 976. | Staples and Zeiger, 2008 | Program: not specified |
Capillary | Nonpolar | 976. | Staples and Zeiger, 2008 | Program: not specified |
Capillary | Nonpolar | 977. | Staples and Zeiger, 2008 | Program: not specified |
Capillary | HP-5 | 986. | Zhao, Li, et al., 2008 | 30. m/0.25 mm/0.25 μm; Program: 40 0C (2 min) 5 0C/min -> 80 0C 7 oC/min -> 160 0C 9 0C/min -> 200 0C 20 0C/min -> 280 0C (10 min) |
Capillary | HP-5 | 989. | Zhao, Li, et al., 2008 | 30. m/0.25 mm/0.25 μm; Program: not specified |
Capillary | DB-5 MS | 974. | Zhu, Li, et al., 2008 | 30. m/0.25 mm/0.25 μm, Helium; Program: 50 0C (2.8 min) 5.5 0C/min -> 140 0C (1 min) 4.5 oC/min -> 220 0C -> 225 0C (2 min) 3.4 0C/min -> 265 0C (5 min) |
Capillary | DB-5 MS | 976. | Zhu, Li, et al., 2008 | 30. m/0.25 mm/0.25 μm, Helium; Program: 50 0C (2.8 min) 5.5 0C/min -> 140 0C (1 min) 4.5 oC/min -> 220 0C -> 225 0C (2 min) 3.4 0C/min -> 265 0C (5 min) |
Capillary | HP-5 | 984. | Dou, Li, et al., 2007 | 30. m/0.32 mm/0.25 μm, He; Program: 40 0C (2 min) 110 0C (2 min) 3 0C/min -> 170 0C (2 min) 4 0C/min -> 220 0C (2 min) 10 0C/min -> 260 0C (5 min) |
Capillary | OV-101 | 952. | Ebrahimi and Hadjmohammadi, 2006 | Program: not specified |
Capillary | RTX-5 | 980. | Ádámová, Orinák, et al., 2005 | 30. m/0.25 mm/0.25 μm, N2; Program: not specified |
Capillary | RTX-5 | 980. | Ádámová, Orinák, et al., 2005 | 30. m/0.25 mm/0.25 μm, N2; Program: not specified |
Capillary | SE-30 | 1002. | Vinogradov, 2004 | Program: not specified |
Capillary | SPB-5 | 977. | Begnaud, Pérès, et al., 2003 | 60. m/0.32 mm/1. μm; Program: not specified |
Capillary | CP Sil 5 CB | 961. | Counet, Callemien, et al., 2002 | 50. m/0.32 mm/1.2 μm; Program: 36C => 20C/min => 85C => 1C/min => 145C=3C/min => 250C(30min) |
Capillary | DB-5MS | 973. | Fu, Yoon, et al., 2002 | Program: not specified |
Capillary | Methyl phenyl siloxane (not specified) | 976. | Poligne, Collignan, et al., 2002 | Program: not specified |
Capillary | HP-5MS | 995. | Ansorena, Gimeno, et al., 2001 | 30. m/0.25 mm/0.25 μm, He; Program: 40C (10min) => 3C/min => 120C => 10C/min => 250C (5min) |
Capillary | DB-5 MS | 984. | Luo and Agnew, 2001 | 30. m/0.25 mm/1.0 μm, Helium; Program: not specified |
Capillary | HP-5 | 987. | Ansorena, Astiasarán, et al., 2000 | 30. m/0.25 mm/0.25 μm, He; Program: 40C (10min) => 3C/min => 120C => 10C/min => 250C (5min) |
Capillary | CP Sil 5 CB | 956. | Guyot, Scheirman, et al., 1999 | He; Column length: 50. m; Column diameter: 0.32 mm; Program: 30C => 55C/min => 85C => 1C/min => 145C => 3C/min => 250C |
Capillary | CP Sil 5 CB | 962. | Guyot, Bouseta, et al., 1998 | 50. m/0.32 mm/1.2 μm, He; Program: 30C => 55C/min => 85C => 1C/min => 145C => 3C/min => 250C |
Capillary | DB-5 | 985. | Mateo, Aguirrezábal, et al., 1997 | 50. m/0.32 mm/0.25 μm, He; Program: 40C(10min) => 3C/min => 95C => 10C/min => 270C(10min) |
Capillary | DB-5 | 982. | Mateo and Zumalacárregui, 1996 | 50. m/0.32 mm/0.25 μm, He; Program: 40C (10min) => 3C/min => 95C => 10C/min => 270C (10min) |
Capillary | DB-5 | 983. | Mateo and Zumalacárregui, 1996 | 50. m/0.32 mm/0.25 μm, He; Program: 40C (10min) => 3C/min => 95C => 10C/min => 270C (10min) |
Capillary | DB-1 | 962. | Peng, 1996 | 30. m/0.53 mm/1.5 μm; Program: 40 0C (4 min) 8 0C/min -> 200 0C (1 min) 5 0C/min -> 280 0C (20 min) |
Capillary | RSL-150 | 1002. | Buchbauer, Nikiforov, et al., 1994 | 60. m/0.32 mm/0.25 μm, He; Program: 30c (1.5min) => 20C/min => 55C => 6C/min => 200C(10min) |
Capillary | DB-1 | 964. | Ciccioli, Cecinato, et al., 1994 | 60. m/0.32 mm/0.25 μm; Program: not specified |
Capillary | DB-1 | 961. | Hathcock and Bertsch, 1993 | 100. m/0.25 mm/0.5 μm; Program: not specified |
Capillary | SE-54 | 982. | Um, Bailey, et al., 1992 | He; Column length: 50. m; Column diameter: 0.32 mm; Program: 35 0C (5 min) 8 0C/min -> 200 0C 2 0C/min -> 250 0C |
Capillary | DB-1 | 961. | Kawai, Ishida, et al., 1991 | 60. m/0.25 mm/0.25 μm; Program: not specified |
Capillary | DB-1 | 964. | Kawai, Ishida, et al., 1991 | 60. m/0.25 mm/0.25 μm; Program: not specified |
Capillary | Polydimethyl siloxane, unknown content of Ph-groups | 973. | Geldon, 1989 | Program: not specified |
Capillary | Polydimethyl siloxane, unknown content of Ph-groups | 987. | Geldon, 1989 | Program: not specified |
Capillary | OV-1 | 959. | Waggott and Davies, 1984 | Hydrogen; Column length: 50. m; Column diameter: 0.32 mm; Program: not specified |
Capillary | OV-1, SE-30, Methyl silicone, SP-2100, OV-101, DB-1, etc. | 926. | Waggott and Davies, 1984 | Hydrogen; Column length: 50. m; Column diameter: 0.32 mm; Program: not specified |
Other | Methyl Silicone | 981. | Ardrey and Moffat, 1981 | Program: not specified |

Normal alkane RI, polar column, temperature ramp

Column type | Active phase | I | Reference | Comment |
---|---|---|---|---|
Capillary | HP-FFAP | 2035. | Wanakhachornkrai and Lertsiri, 9999 | 25. m/0.32 mm/0.50 μm, Helium, 15. K/min; Tstart: 45. C; Tend: 220. C |
Capillary | HP-FFAP | 2039. | Wanakhachornkrai and Lertsiri, 9999 | 25. m/0.32 mm/0.50 μm, Helium, 15. K/min; Tstart: 45. C; Tend: 220. C |
Capillary | HP-FFAP | 2039. | Wanakhachornkrai and Lertsiri, 9999 | 25. m/0.32 mm/0.50 μm, Helium, 15. K/min; Tstart: 45. C; Tend: 220. C |
Capillary | HP-Innowax | 2012. | Puvipirom and Chaisei, 2012 | 15. m/0.32 mm/0.50 μm, Helium, 3. K/min; Tstart: 40. C; Tend: 250. C |
Capillary | AT-Wax | 2007. | Kiss, Csoka, et al., 2011 | 60. m/0.25 mm/0.25 μm, Helium, 4. K/min; Tstart: 60. C; Tend: 280. C |
Capillary | FFAP | 1995. | Piyachaiseth, Jirapakkul, et al., 2011 | 60. m/0.25 mm/0.25 μm, Helium, 45. C @ 1. min, 5. K/min, 220. C @ 5. min |
Capillary | CP-Wax | 1989. | Mo, Fan, et al., 2009 | 60. m/0.25 mm/0.25 μm, Helium, 50. C @ 2. min, 6. K/min, 230. C @ 15. min |
Capillary | DB-Wax | 2030. | Moon and Shibamoto, 2009 | 60. m/0.25 mm/0.50 μm, Helium, 40. C @ 5. min, 2. K/min, 210. C @ 70. min |
Capillary | DB-Wax | 2008. | Zhao, Xu, et al., 2009 | 30. m/0.25 mm/0.25 μm, Helium, 40. C @ 2. min, 3. K/min, 230. C @ 5. min |
Capillary | Innowax | 2020. | Kaypak and Avsar, 2008 | 30. m/0.25 mm/0.25 μm, 40. C @ 5. min, 10. K/min, 200. C @ 15. min |
Capillary | HP-Innowax | 2011. | Soria, Sanz, et al., 2008 | 50. m/0.20 mm/0.20 μm, Helium, 45. C @ 2. min, 4. K/min, 190. C @ 50. min |
Capillary | Supelcowax-10 | 1994. | Vichi, Romero, et al., 2008 | 30. m/0.25 mm/0.25 μm, Helium, 50. C @ 10. min, 8. K/min; Tend: 240. C |
Capillary | Stabilwax | 2019. | Cros, Vandanjon, et al., 2007 | 60. m/0.25 mm/0.25 μm, Helium, 40. C @ 5. min, 3. K/min, 240. C @ 10. min |
Capillary | RTX-Wax | 1993. | Prososki, Etzel, et al., 2007 | 30. m/0.25 mm/0.5 μm, He, 40. C @ 5. min, 10. K/min, 220. C @ 10. min |
Capillary | DB-Wax | 2007. | Xu, Fan, et al., 2007 | 30. m/0.25 mm/0.25 μm, He, 40. C @ 2. min, 4. K/min, 230. C @ 5. min |
Capillary | DB-Wax | 2007. | Fan and Qian, 2006, 2 | 30. m/0.32 mm/0.25 μm, He, 40. C @ 2. min, 4. K/min, 230. C @ 15. min |
Capillary | DB-Wax | 2007. | Fan and Qian, 2006, 2 | 30. m/0.32 mm/0.25 μm, He, 40. C @ 2. min, 4. K/min, 230. C @ 15. min |
Capillary | DB-Wax | 2015. | Fan and Qian, 2006 | 30. m/0.32 mm/0.25 μm, N2, 40. C @ 2. min, 6. K/min, 230. C @ 15. min |
Capillary | DB-Wax Etr | 2023. | Perestrelo, Fernandes, et al., 2006 | 30. m/0.25 mm/0.25 μm, He, 40. C @ 1. min, 2. K/min, 220. C @ 10. min |
Capillary | ZB-Wax | 2035. | Wierda R.L., Fletcher G., et al., 2006 | 60. m/0.32 mm/0.5 μm, He, 40. C @ 2. min, 3. K/min, 250. C @ 10. min |
Capillary | Carbowax 20M | 2017. | de la Fuente, Martinez-Castro, et al., 2005 | 50. m/0.25 mm/0.25 μm, Helium, 40. C @ 2. min, 4. K/min, 190. C @ 30. min |
Capillary | TC-FFAP | 2015. | Kurose and Yatagai, 2005 | 60. m/0.25 mm/0.4 μm, He, 3. K/min, 220. C @ 30. min; Tstart: 60. C |
Capillary | DB-Wax | 2039. | Qian and Wang, 2005 | 60. m/0.32 mm/0.50 μm, Nitrogen, 35. C @ 4. min, 2. K/min, 235. C @ 30. min |
Capillary | PEG-20M | 2020. | Yao, Guo, et al., 2005 | 60. C @ 10. min, 3. K/min, 180. C @ 30. min; Column length: 30. m; Column diameter: 0.25 mm |
Capillary | DB-Wax | 1969. | López, Ezpeleta, et al., 2004 | 60. m/0.25 mm/0.25 μm, He, 40. C @ 5. min, 3. K/min; Tend: 220. C |
Capillary | HP-Innowax | 2045. | Soria, Gonzalez, et al., 2004 | 50. m/0.2 mm/0.2 μm, He, 45. C @ 2. min, 4. K/min, 190. C @ 50. min |
Capillary | DB-Wax | 2012. | Yanagimoto, Ochi, et al., 2004 | 30. m/0.25 mm/0.25 μm, He, 3. K/min, 180. C @ 40. min; Tstart: 50. C |
Capillary | Stabilwax | 2019. | Cros, Vandanjon, et al., 2003, 2 | 60. m/0.25 mm/0.25 μm, Helium, 40. C @ 5. min, 3. K/min, 240. C @ 10. min |
Capillary | TC-Wax | 2011. | Miyazawa and Okuno, 2003 | He, 4. K/min, 250. C @ 30. min; Column length: 60. m; Column diameter: 0.25 mm; Tstart: 80. C |
Capillary | Carbowax 20M | 1946. | Saura, LAencina, et al., 2003 | Helium, 50. C @ 2. min, 4. K/min; Column length: 50. m; Column diameter: 0.70 mm; Tend: 280. C |
Capillary | DB-Wax | 2007. | Tanaka, Yamauchi, et al., 2003 | 30. m/0.25 mm/0.25 μm, 30. C @ 1. min, 4. K/min; Tend: 250. C |
Capillary | DB-Wax | 2009. | Tanaka, Yamauchi, et al., 2003 | 30. m/0.25 mm/0.25 μm, 30. C @ 1. min, 4. K/min; Tend: 250. C |
Capillary | Supelcowax-10 | 1995. | Vichi, Pizzale, et al., 2003 | 30. m/0.25 mm/0.25 μm, He, 40. C @ 10. min, 3. K/min; Tend: 200. C |
Capillary | HP-FFAP | 2039. | Wanakhachornkrai and Lertsiri, 2003 | 25. m/0.32 mm/0.5 μm, He, 15. K/min; Tstart: 45. C; Tend: 220. C |
Capillary | HP-FFAP | 2039. | Wanakhachornkrai and Lertsiri, 2003 | 25. m/0.32 mm/0.5 μm, He, 15. K/min; Tstart: 45. C; Tend: 220. C |
Capillary | HP-FFAP | 2035. | Wanakhachornkrai and Lertsiri, 2003 | 25. m/0.32 mm/0.5 μm, He, 15. K/min; Tstart: 45. C; Tend: 220. C |
Capillary | DB-Wax | 1955. | Fu, Yoon, et al., 2002 | 30. m/0.25 mm/0.25 μm, He, 40. C @ 5. min, 8. K/min, 250. C @ 5. min |
Capillary | FFAP | 1949. | Lecanu, Ducruet, et al., 2002 | 30. m/0.32 mm/1. μm, He, 35. C @ 3. min, 5. K/min; Tend: 240. C |
Capillary | DB-Wax | 1973. | Osorio, Duque, et al., 2002 | 30. m/0.25 mm/0.25 μm, He, 50. C @ 4. min, 4. K/min, 220. C @ 20. min |
Capillary | DB-Wax | 1984. | Osorio, Duque, et al., 2002 | 30. m/0.25 mm/0.25 μm, He, 50. C @ 4. min, 4. K/min, 220. C @ 20. min |
Capillary | EC-1000 | 2015. | Bendall, 2001 | 30. m/0.25 mm/0.25 μm, He, 35. C @ 5. min, 5. K/min, 230. C @ 15. min |
Capillary | DB-Wax | 1951. | Lee and Shibamoto, 2000 | 30. m/0.25 mm/0.25 μm, He, 3. K/min, 180. C @ 40. min; Tstart: 50. C |
Capillary | DB-Wax | 2005. | Paniandy, Chane-Ming, et al., 2000 | 60. m/0.32 mm/0.25 μm, Helium, 50. C @ 2. min, 5. K/min; Tend: 230. C |
Capillary | DB-Wax | 1950. | Parada, Duque, et al., 2000 | 30. m/0.25 mm/0.25 μm, He, 50. C @ 3. min, 4. K/min, 240. C @ 10. min |
Capillary | DB-Wax | 1989. | Parada, Duque, et al., 2000 | 30. m/0.25 mm/0.25 μm, He, 50. C @ 3. min, 4. K/min, 240. C @ 10. min |
Capillary | DB-Wax | 1983. | Iwatsuki, Mizota, et al., 1999 | 4. K/min; Column length: 30. m; Column diameter: 0.53 mm; Tstart: 60. C; Tend: 210. C |
Capillary | DB-Wax | 2000. | Umano, Nakahara, et al., 1999 | 60. m/0.25 mm/0.25 μm, He, 40. C @ 2. min, 2. K/min; Tend: 200. C |
Capillary | Supelcowax | 1990. | Näf and Velluz, 1998 | He, 5. K/min; Column length: 60. m; Column diameter: 0.25 mm; Tstart: 80. C; Tend: 240. C |
Capillary | DB-Wax | 2004. | Sekiwa, Kubota, et al., 1997 | He, 2. K/min; Column length: 60. m; Column diameter: 0.25 mm; Tstart: 60. C; Tend: 180. C |
Capillary | PEG-20M | 1958. | Kubota, Matsujage, et al., 1996 | 50. m/0.25 mm/0.25 μm, Nitrogen, 2. K/min; Tstart: 60. C; Tend: 180. C |
Capillary | TC-Wax | 2028. | Shuichi, Masazumi, et al., 1996 | 80. C @ 5. min, 3. K/min; Column length: 60. m; Column diameter: 0.25 mm; Tend: 240. C |
Capillary | Carbowax 20M | 1956. | Kawakami, Ganguly, et al., 1995 | 60. C @ 4. min, 2. K/min; Column length: 60. m; Column diameter: 0.25 mm; Tend: 180. C |
Capillary | Carbowax 20M | 1957. | Kawakami, Kobayashi, et al., 1993 | He, 60. C @ 4. min, 2. K/min; Column length: 50. m; Column diameter: 0.25 mm; Tend: 180. C |
Capillary | DB-Wax | 1969. | Hatsuko, Kazuko, et al., 1992 | He, 60. C @ 10. min, 3. K/min; Column length: 30. m; Column diameter: 0.25 mm; Tend: 240. C |
Capillary | Carbowax 20M | 1953. | Kawakami and Kobayashi, 1991 | He, 60. C @ 4. min, 2. K/min; Column length: 50. m; Column diameter: 0.25 mm; Tend: 180. C |
Capillary | PEG-20M | 1988. | Kubota, Nakamoto, et al., 1991 | N2, 2. K/min; Column length: 50. m; Column diameter: 0.25 mm; Tstart: 60. C; Tend: 180. C |
Capillary | DB-Wax | 1996. | Binder, Benson, et al., 1990 | 4. K/min, 230. C @ 10. min; Column length: 60. m; Column diameter: 0.32 mm; Tstart: 50. C |
Capillary | Supelcowax-10 | 2014. | Hsieh, Williams, et al., 1989 | 60. m/0.25 mm/0.25 μm, He, 40. C @ 5. min, 1. K/min; Tend: 175. C |
Capillary | DB-Wax | 2004. | Andersen J.F., Mikolajczak K.L., et al., 1987 | Helium, 40. C @ 1. min, 6. K/min; Column length: 30. m; Column diameter: 0.32 mm; Tend: 200. C |

Normal alkane RI, polar column, custom temperature program

Column type | Active phase | I | Reference | Comment |
---|---|---|---|---|
Capillary | DB-Wax | 1973. | Welke, Manfroi, et al., 2012 | 30. m/0.25 mm/0.25 μm, Helium; Program: not specified |
Capillary | DB-Wax | 1978. | Welke, Manfroi, et al., 2012 | 30. m/0.25 mm/0.25 μm, Helium; Program: not specified |
Capillary | DB-Wax | 2002. | Welke, Manfroi, et al., 2012 | 30. m/0.25 mm/0.25 μm, Helium; Program: not specified |
Capillary | HP-Innowax | 2037. | Xiao, Dai, et al., 2011 | 60. m/0.25 mm/0.25 μm, Helium; Program: 40 0C (2 min) 3 0C/min -> 150 0C 5 0C/min -> 220 0C (5 min) |
Capillary | Supelko CO Wax | 2022. | Vekiari, Orepoulou, et al., 2010 | 60. m/0.32 mm/0.25 μm, Helium; Program: 40 0C (5 min) 4 0C/min -> 75 0C 5 0C/min -> 250 0C (10 min) |
Capillary | Supelko CO Wax | 2020. | Vekiari, Orepoulou, et al., 2010 | 60. m/0.32 mm/0.25 μm, Helium; Program: not specified |
Capillary | DB-FFAP | 1996. | Mebazaa, Mahmoudi, et al., 2009 | 30. m/0.25 mm/0.25 μm, Helium; Program: 50 0C 2 0C/min -> 100 0C (5 min) 5 0C/min -> 250 0C |
Capillary | DB-FFAP | 1998. | Mebazaa, Mahmoudi, et al., 2009 | 30. m/0.25 mm/0.25 μm, Helium; Program: not specified |
Capillary | Supelcowax-10 | 1978. | de Simon, Estruelas, et al., 2009 | 30. m/0.25 mm/0.25 μm, Helium; Program: 45 0C 3 0C/min -> 230 0C (10 min) 10 0C/min -> 270 0C (21 min) |
Capillary | DB-Wax | 2007. | Zhao, Xu, et al., 2009 | 30. m/0.25 mm/0.25 μm, Helium; Program: not specified |
Capillary | DB-Wax | 1989. | Tao, Wenlai, et al., 2008 | 30. m/0.32 mm/0.25 μm, Helium; Program: 50 0C 20 0C/min -> 80 0C 3 0C/min -> 230 0C |
Capillary | PEG 20M | 2004. | Zhang, Zhang, et al., 2008 | 30. m/0.25 mm/0.25 μm, Helium; Program: 40 0C (3 min) 5 0C/min -> 60 0C 6 0C/min -> 130 0C 10 0C/min -> 230 0C |
Capillary | DB-Wax | 2007. | Gonzalez-Rios, Suarez-Quiroz, et al., 2007 | 30. m/0.25 mm/0.25 μm, Hydrogen; Program: 44 0C 3 0C/min -> 170 0C 8 0C/min -> 250 0C |
Capillary | DB-Wax | 1984. | Gonzalez-Rios, Suarez-Quiroz, et al., 2007 | 30. m/0.25 mm/0.25 μm, Hydrogen; Program: not specified |
Capillary | DB-Wax | 2000. | Tian, Zhang, et al., 2007 | 30. m/0.25 mm/0.25 μm, He; Program: 50 0C (2 min) 6 0C/min -> 150 0C 8 0C/min -> 230 0C (15 min) |
Capillary | Supelcowax-10 | 2020. | Vichi, Guadayol, et al., 2007 | 30. m/0.25 mm/0.25 μm, He; Program: 40C(3min) => 4C/min => 75C => 8C/min => 250C(5min) |
Capillary | PEG-20M | 2004. | Zhang C., Zhang H., et al., 2007 | 30. m/0.25 mm/0.25 μm; Program: 40C(3min) => 5C/min => 60C => 6C/min => 130C => 10C/min => 230C (10min) |
Capillary | DB-Wax | 1993. | Krings, Zelena, et al., 2006 | 30. m/0.32 mm/0.25 μm, He; Program: 45C(5min) => 5C/min => 150C => 10C/min => 240C (10min) |
Capillary | DB-Wax | 1996. | Lee, Lee, et al., 2005, 2 | 60. m/0.32 mm/0.25 μm, He; Program: 30C(4min) => 2C/min => 170C(25min) => 10C/min => 210C(10min) |
Capillary | DB-Wax | 2000. | Lee, Lee, et al., 2005, 2 | 60. m/0.32 mm/0.25 μm, He; Program: 30C(4min) => 2C/min => 170C(25min) => 10C/min => 210C(10min) |
Capillary | HP-Innowax | 2014. | Piasenzotto, Gracco, et al., 2003 | 30. m/0.32 mm/0.5 μm, He; Program: 50C(4min) => 10C/min => 230C(10min) => 10C/min => 250C |
Capillary | DB-Wax | 1996. | Mayorga, Knapp, et al., 2001 | 30. m/0.25 mm/0.25 μm; Program: 50C(4min) => 4C/min => 130C => 1C/min => 190C => 4C/min => 220C(20min) |
Capillary | DB-Wax | 2009. | Mayorga, Knapp, et al., 2001 | 30. m/0.25 mm/0.25 μm; Program: 50C(4min) => 4C/min => 130C => 1C/min => 190C => 4C/min => 220C(20min) |
Capillary | DB-Wax | 1979. | Caldentey, Daria Fumi, et al., 1998 | 30. m/0.25 mm/0.25 μm, He; Program: 25C(8min) => 4C/min => 60C => 6C/min => 160C => 20C/min => 200C |
Capillary | DB-FFAP | 1995. | Lizárraga-Guerra, Guth, et al., 1997 | He; Column length: 30. m; Column diameter: 0.32 mm; Program: 35C => 40C/min => 60C (1min) => 6C/min => 250C |
Capillary | DB-Wax | 1954. | Peng, 1996 | 30. m/0.53 mm/1.0 μm; Program: 40 0C (4 min) 4 0C/min -> 200 0C (20 min) |
Capillary | DB-Wax | 1955. | Hatsuko, Kazuko, et al., 1992 | He; Column length: 30. m; Column diameter: 0.25 mm; Program: not specified |
Capillary | DB-Wax | 1954. | Peng, Yang, et al., 1991, 2 | Program: not specified |
Capillary | Superox 0.6; Carbowax 20M | 1961. | Waggott and Davies, 1984 | Hydrogen; Column length: 50. m; Column diameter: 0.32 mm; Program: not specified |
Capillary | Carbowax 400, Carbowax 20M, Carbowax 1540, Carbowax 4000, Superox 06, PEG 20M, etc. | 1967. | Waggott and Davies, 1984 | Hydrogen; Column length: 50. m; Column diameter: 0.32 mm; Program: not specified |

Lee's RI, non-polar column, temperature ramp

Column type | Active phase | I | Reference | Comment |
---|---|---|---|---|
Capillary | HP-5 | 151.4 | Wang, Hou, et al., 2007 | 30. m/0.30 mm/0.25 μm, Helium, 50. C @ 5. min, 5. K/min, 200. C @ 15. min |
Capillary | HP-5 | 151.6 | Shao, Wang, et al., 2006 | 30. m/0.3 mm/0.25 μm, He, 50. C @ 5. min, 5. K/min, 200. C @ 15. min |
Capillary | DB-5 | 156.32 | Williams and Horne, 1995 | He, 60. C @ 2. min, 5. K/min; Column length: 25. m; Column diameter: 0.3 mm; Tend: 270. C |
Capillary | DB-5 | 154.7 | Donnelly, Abdel-Hamid, et al., 1993 | 30. m/0.32 mm/0.25 μm, He, 40. C @ 3. min, 8. K/min, 285. C @ 29.5 min |
Capillary | DB-5 | 156.32 | Rostad and Pereira, 1986 | 30. m/0.26 mm/0.25 μm, He, 50. C @ 4. min, 6. K/min, 300. C @ 20. min |

Lee's RI, non-polar column, custom temperature program

Column type | Active phase | I | Reference | Comment |
---|---|---|---|---|
Capillary | DB-5 | 152.2 | Fuentes, Font, et al., 2007 | Column length: 60. m; Program: not specified |
Capillary | DB-5MS | 150.4 | Aracil, Font, et al., 2005 | Column length: 60. m; Column diameter: 0.25 mm; Program: not specified |
Capillary | Methyl Silicone | 156.32 | Eckel, Ross, et al., 1993 | Program: not specified |
Capillary | Methyl Silicone | 158.08 | Eckel, Ross, et al., 1993 | Program: not specified |

Condensed phase thermochemistry data

Data compiled as indicated in comments:
ALS - Hussein Y. Afeefy, Joel F. Liebman, and Stephen E. Stein
DH - Eugene S. Domalski and Elizabeth D. Hearing
Quantity | Value | Units | Method | Reference | Comment |
---|---|---|---|---|---|
ΔfH°solid | -39.44 | kcal/mol | Ccb | Cox, 1961 | ALS |
ΔfH°solid | -39.46 ± 0.30 | kcal/mol | Ccb | Andon, Biddiscombe, et al., 1960 | ALS |
ΔfH°solid | -38.90 ± 0.25 | kcal/mol | Ccb | Parks, Manchester, et al., 1954 | ALS |
ΔfH°solid | -39.18 | kcal/mol | Ccb | Badoche, 1941 | Author's hf298_condensed=-41.49 kcal/mol; ALS |
Quantity | Value | Units | Method | Reference | Comment |
ΔcH°solid | -731. ± 3. | kcal/mol | AVG | N/A | Average of 6 values; Individual data points |
Quantity | Value | Units | Method | Reference | Comment |
S°solid,1 bar | 34.419 | cal/mol*K | N/A | Andon, Counsell, et al., 1963 | DH |
S°solid,1 bar | 34.11 | cal/mol*K | N/A | Parks, Huffman, et al., 1933 | Extrapolation below 90 K, 49.04 J/mol*K.; DH |
Constant pressure heat capacity of solid
Cp,solid (cal/mol*K) | Temperature (K) | Reference | Comment |
---|---|---|---|
30.404 | 298.15 | Nichols and Wads, 1975 | DH |
47.75 | 313. | Rastorguev and Ganiev, 1967 | T = 313 to 373 K.; DH |
30.459 | 298.15 | Andon, Counsell, et al., 1963 | T = 13 to 336 K.; DH |
22.4 | 293. | Campbell and Campbell, 1940 | DH |
24.81 | 229.3 | Aoyama and Kanda, 1935 | T = 78 to 229 K. Value is unsmoothed experimental datum.; DH |
31.809 | 295.8 | Parks, Huffman, et al., 1933 | T = 93 to 296 K. Value is unsmoothed experimental datum.; DH |

Phase change data

Data compiled as indicated in comments:
TRC - Thermodynamics Research Center, NIST Boulder Laboratories, Chris Muzny director
BS - Robert L. Brown and Stephen E. Stein
AC - William E. Acree, Jr., James S. Chickos
DRB - Donald R. Burgess, Jr.
ALS - Hussein Y. Afeefy, Joel F. Liebman, and Stephen E. Stein
DH - Eugene S. Domalski and Elizabeth D. Hearing
CAL - James S. Chickos, William E. Acree, Jr., Joel F. Liebman, Students of Chem 202 (Introduction to the Literature of Chemistry), University of Missouri -- St. Louis
Quantity | Value | Units | Method | Reference | Comment |
---|---|---|---|---|---|
Tboil | 455.0 ± 0.6 | K | AVG | N/A | Average of 25 out of 27 values; Individual data points |
Quantity | Value | Units | Method | Reference | Comment |
Tfus | 314. ± 1. | K | AVG | N/A | Average of 60 out of 61 values; Individual data points |
Quantity | Value | Units | Method | Reference | Comment |
Ttriple | 314.06 | K | N/A | Andon, Counsell, et al., 1963, 2 | Uncertainty assigned by TRC = 0.01 K; TRC |
Quantity | Value | Units | Method | Reference | Comment |
Tc | 694.3 | K | N/A | Delaunois, 1968 | Uncertainty assigned by TRC = 0.4 K; TRC |
Tc | 694.25 | K | N/A | Ambrose, 1963 | Uncertainty assigned by TRC = 0.15 K; TRC |
Tc | 692.4 | K | N/A | Radice, 1899 | Uncertainty assigned by TRC = 2. K; TRC |
Quantity | Value | Units | Method | Reference | Comment |
Pc | 58.52 | atm | N/A | Delaunois, 1968 | Uncertainty assigned by TRC = 0.7742 atm; TRC |
Pc | 60.5000 | atm | N/A | Herz and Neukirch, 1923 | Uncertainty assigned by TRC = 0.8000 atm; TRC |
Quantity | Value | Units | Method | Reference | Comment |
ΔvapH° | 14.1 | kcal/mol | CGC | Chickos, Hosseini, et al., 1995 | Based on data from 393. to 433. K.; AC |
Quantity | Value | Units | Method | Reference | Comment |
ΔsubH° | 16.7 ± 0.2 | kcal/mol | ME | Parsons, Rochester, et al., 1971 | Based on data from 230. to 273. K.; AC |
ΔsubH° | 16.4 | kcal/mol | N/A | Cox, 1961 | DRB |
ΔsubH° | 16.41 ± 0.12 | kcal/mol | V | Andon, Biddiscombe, et al., 1960 | ALS |
ΔsubH° | 16.4 | kcal/mol | N/A | Andon, Biddiscombe, et al., 1960 | DRB |
Enthalpy of vaporization
ΔvapH (kcal/mol) | Temperature (K) | Method | Reference | Comment |
---|---|---|---|---|
12.7 | 378. | EB | Chylinski, Fras, et al., 2001 | Based on data from 363. to 391. K.; AC |
11.8 | 470. | A | Stephenson and Malanowski, 1987 | Based on data from 455. to 655. K.; AC |
13.7 | 329. | A | Stephenson and Malanowski, 1987 | Based on data from 314. to 395. K.; AC |
12.2 | 402. | A | Stephenson and Malanowski, 1987 | Based on data from 387. to 456. K.; AC |
11.2 | 464. | A | Stephenson and Malanowski, 1987 | Based on data from 449. to 526. K.; AC |
10.5 | 535. | A | Stephenson and Malanowski, 1987 | Based on data from 520. to 625. K.; AC |
12.3 | 398. | EB,GS | Stephenson and Malanowski, 1987 | Based on data from 383. to 473. K. See also Andon, Biddiscombe, et al., 1960, 2 and Dykyj, 1972.; AC |
12.3 | 395. | N/A | Dreisbach and Shrader, 1949 | Based on data from 380. to 455. K. See also Dreisbach and Martin, 1949 and Boublik, Fried, et al., 1984.; AC |
11.5 | 434. | N/A | Goldblum, Martin, et al., 1947 | Based on data from 414. to 454. K.; AC |
Antoine Equation Parameters
log10(P) = A − (B / (T + C))
P = vapor pressure (atm)
T = temperature (K)
View plot Requires a JavaScript / HTML 5 canvas capable browser.
Temperature (K) | A | B | C | Reference | Comment |
---|---|---|---|---|---|
380.30 to 454.90 | 4.24117 | 1509.677 | -98.949 | Dreisbach and Shrader, 1949 | Coefficents calculated by NIST from author's data. |
Enthalpy of sublimation
ΔsubH (kcal/mol) | Temperature (K) | Method | Reference | Comment |
---|---|---|---|---|
15.6 ± 0.79 | 280. | HSA | Chickos, 1975 | Based on data from 263. to 298. K.; AC |
16.4 ± 0.1 | 282. to 313. | GS | Andon, Biddiscombe, et al., 1960, 2 | See also Cox and Pilcher, 1970.; AC |
16.3 | 293. | ME | Sklyarenko, Markin, et al., 1958 | Based on data from 283. to 303. K.; AC |
16.3 | 292. | N/A | Nitta and Seki, 1948 | Based on data from 270. to 313. K.; AC |
16.2 | 278. to 305. | TE | Balson, 1947 | See also Jones, 1960.; AC |
Enthalpy of fusion
ΔfusH (kcal/mol) | Temperature (K) | Reference | Comment |
---|---|---|---|
2.7519 | 314.06 | Andon, Counsell, et al., 1963 | DH |
2.8979 | 314.13 | Mastrangelo, 1957 | DH |
2.751 | 314. | Inozemtsev, Liakumovich, et al., 1972 | See also Domalski and Hearing, 1996.; AC |
2.5289 | 312.7 | Eykman, 1889 | DH |
Entropy of fusion
ΔfusS (cal/mol*K) | Temperature (K) | Reference | Comment |
---|---|---|---|
8.762 | 314.06 | Andon, Counsell, et al., 1963 | DH |
7.96 | 314. | Bret-Dibat and Lichanot, 1989 | CAL |
8.08 | 312.7 | Eykman, 1889 | DH |

Gas phase ion energetics data

Data evaluated as indicated in comments:
HL - Edward P. Hunter and Sharon G. Lias
L - Sharon G. Lias
Data compiled as indicated in comments:
B - John E. Bartmess
LL - Sharon G. Lias and Joel F. Liebman
LBLHLM - Sharon G. Lias, John E. Bartmess, Joel F. Liebman, John L. Holmes, Rhoda D. Levin, and W. Gary Mallard
LLK - Sharon G. Lias, Rhoda D. Levin, and Sherif A. Kafafi
RDSH - Henry M. Rosenstock, Keith Draxl, Bruce W. Steiner, and John T. Herron
Quantity | Value | Units | Method | Reference | Comment |
---|---|---|---|---|---|
IE (evaluated) | 8.49 ± 0.02 | eV | N/A | N/A | L |
Quantity | Value | Units | Method | Reference | Comment |
Proton affinity (review) | 195.3 | kcal/mol | N/A | Hunter and Lias, 1998 | HL |
Quantity | Value | Units | Method | Reference | Comment |
Gas basicity | 187.9 | kcal/mol | N/A | Hunter and Lias, 1998 | HL |
Ionization energy determinations
Appearance energy determinations
Ion | AE (eV) | Other Products | Method | Reference | Comment |
---|---|---|---|---|---|
C5H5+ | 12.96 ± 0.10 | CO+H | DER | Fraser-Monteiro, Fraser-Monteiro, et al., 1984 | LBLHLM |
C5H5+ | 14.2 ± 0.2 | CO+H | EI | Tajima and Tsuchiya, 1973 | LLK |
C5H5+ | 14.25 | CO+H | EI | Occolowitz and White, 1968 | RDSH |
C5H6+ | 11.4 ± 0.1 | CO | TRPI | Lifshitz and Malinovich, 1984 | LBLHLM |
C5H6+ | 12.5 ± 0.1 | CO | EI | Henion and Kingston, 1973 | LLK |
C5H6+ | 11.67 | CO | EI | Howe and Williams, 1969 | RDSH |
C5H6+[c-C5H6] | 11.59 ± 0.10 | CO | PIPECO | Fraser-Monteiro, Fraser-Monteiro, et al., 1984 | T = 0K; LBLHLM |
De-protonation reactions
By formula: C6H5O- + H+ = C6H6O
Quantity | Value | Units | Method | Reference | Comment |
---|---|---|---|---|---|
ΔrH° | 349. ± 2. | kcal/mol | AVG | N/A | Average of 6 out of 7 values; Individual data points |
Quantity | Value | Units | Method | Reference | Comment |
ΔrG° | 342.3 ± 2.0 | kcal/mol | IMRE | Bartmess, Scott, et al., 1979 | gas phase; Shiner, Vorner, et al., 1986: tautomer acidities ΔHacid(ortho) = 343.9±3.1 kcal, para = 340.1±2 kcal. However, Capponi, Gut, et al., 1999 based on aq. soln. results, imply 18 and 14 kcal/mol difference.; value altered from reference due to change in acidity scale; B |
ΔrG° | 340.8 ± 1.9 | kcal/mol | CIDC | Angel and Ervin, 2004 | gas phase; B |
ΔrG° | 343.4 ± 2.0 | kcal/mol | IMRE | Cumming and Kebarle, 1978 | gas phase; B |
ΔrG° | >341.5 ± 1.8 | kcal/mol | H-TS | Richardson, Stephenson, et al., 1975 | gas phase; B |

Ion clustering data

Data compiled as indicated in comments:
B - John E. Bartmess
M - Michael M. Meot-Ner (Mautner) and Sharon G. Lias
RCD - Robert C. Dunbar
Clustering reactions
By formula: Br- + C6H6O = (Br- • C6H6O)
Quantity | Value | Units | Method | Reference | Comment |
---|---|---|---|---|---|
ΔrH° | 20.8 ± 1.8 | kcal/mol | IMRE | Paul and Kebarle, 1990 | gas phase; ΔGaff at 423 K; B,M |
ΔrH° | 19.6 | kcal/mol | PHPMS | Paul and Kebarle, 1991 | gas phase; Entropy change calculated or estimated; M |
Quantity | Value | Units | Method | Reference | Comment |
ΔrS° | 20. | cal/mol*K | N/A | Paul and Kebarle, 1991 | gas phase; Entropy change calculated or estimated; M |
ΔrS° | 23. | cal/mol*K | N/A | Paul and Kebarle, 1990 | gas phase; Entropy change calculated or estimated; M |
Quantity | Value | Units | Method | Reference | Comment |
ΔrG° | 11.1 ± 1.0 | kcal/mol | IMRE | Paul and Kebarle, 1990 | gas phase; ΔGaff at 423 K; B |
Free energy of reaction
ΔrG° (kcal/mol) | T (K) | Method | Reference | Comment |
---|---|---|---|---|
11.1 | 423. | PHPMS | Paul and Kebarle, 1991 | gas phase; Entropy change calculated or estimated; M |
11.1 | 423. | PHPMS | Paul and Kebarle, 1990 | gas phase; Entropy change calculated or estimated; M |
By formula: C2H3O2- + C6H6O = (C2H3O2- • C6H6O)
Quantity | Value | Units | Method | Reference | Comment |
---|---|---|---|---|---|
ΔrH° | 26.1 ± 1.0 | kcal/mol | N/A | Meot-Ner and Sieck, 1986 | gas phase; B,M |
Quantity | Value | Units | Method | Reference | Comment |
ΔrS° | 24.0 | cal/mol*K | PHPMS | Meot-Ner and Sieck, 1986 | gas phase; M |
Quantity | Value | Units | Method | Reference | Comment |
ΔrG° | 18.9 ± 1.6 | kcal/mol | TDAs | Meot-Ner and Sieck, 1986 | gas phase; B |
By formula: Cl- + C6H6O = (Cl- • C6H6O)
Quantity | Value | Units | Method | Reference | Comment |
---|---|---|---|---|---|
ΔrH° | 26.0 ± 2.0 | kcal/mol | TDAs | French, Ikuta, et al., 1982 | gas phase; B,M |
ΔrH° | 26.0 ± 2.0 | kcal/mol | TDEq | Cummings, French, et al., 1977 | gas phase; Re-anchored to data in French, Ikuta, et al., 1982.; B |
ΔrH° | 27.4 | kcal/mol | PHPMS | Kebarle, 1977 | gas phase; M |
ΔrH° | 26.5 | kcal/mol | PHPMS | Paul and Kebarle, 1990 | gas phase; Entropy change calculated or estimated; M |
ΔrH° | 19.4 ± 2.0 | kcal/mol | TDAs | Yamdagni and Kebarle, 1971 | gas phase; B,M |
Quantity | Value | Units | Method | Reference | Comment |
ΔrS° | 26.0 | cal/mol*K | PHPMS | French, Ikuta, et al., 1982 | gas phase; M |
ΔrS° | 25. | cal/mol*K | PHPMS | Kebarle, 1977 | gas phase; M |
ΔrS° | 25. | cal/mol*K | N/A | Paul and Kebarle, 1990 | gas phase; Entropy change calculated or estimated; M |
ΔrS° | 15.5 | cal/mol*K | PHPMS | Yamdagni and Kebarle, 1971 | gas phase; M |
Quantity | Value | Units | Method | Reference | Comment |
ΔrG° | 19.2 ± 2.0 | kcal/mol | TDAs | French, Ikuta, et al., 1982 | gas phase; B |
ΔrG° | 18.5 ± 2.0 | kcal/mol | TDEq | Cummings, French, et al., 1977 | gas phase; Re-anchored to data in French, Ikuta, et al., 1982.; B |
ΔrG° | 14.8 ± 2.0 | kcal/mol | TDAs | Yamdagni and Kebarle, 1971 | gas phase; B |
Free energy of reaction
ΔrG° (kcal/mol) | T (K) | Method | Reference | Comment |
---|---|---|---|---|
15.9 | 423. | PHPMS | Paul and Kebarle, 1990 | gas phase; Entropy change calculated or estimated; M |
By formula: Cs+ + C6H6O = (Cs+ • C6H6O)
Quantity | Value | Units | Method | Reference | Comment |
---|---|---|---|---|---|
ΔrH° | 15.7 ± 0.8 | kcal/mol | CIDT | Amunugama and Rodgers, 2002 | RCD |
By formula: (Cs+ • C6H6O) + C6H6O = (Cs+ • 2C6H6O)
Quantity | Value | Units | Method | Reference | Comment |
---|---|---|---|---|---|
ΔrH° | 14.5 ± 0.8 | kcal/mol | CIDT | Amunugama and Rodgers, 2002 | RCD |
By formula: F- + C6H6O = (F- • C6H6O)
Quantity | Value | Units | Method | Reference | Comment |
---|---|---|---|---|---|
ΔrH° | 41.3 ± 2.0 | kcal/mol | IMRE | Larson and McMahon, 1983 | gas phase; These relative affinities are ca. 10 kcal/mol weaker than threshold values (see Wenthold and Squires, 1995) for donors greater than ca. 27 kcal/mol in free energy. This discrepancy has not yet been resolved, though the stronger value appears preferable.; B,M |
Quantity | Value | Units | Method | Reference | Comment |
ΔrS° | 26.3 | cal/mol*K | N/A | Larson and McMahon, 1983 | gas phase; switching reaction(F-)H2O, Entropy change calculated or estimated; Arshadi, Yamdagni, et al., 1970; M |
Quantity | Value | Units | Method | Reference | Comment |
ΔrG° | 33.5 ± 2.0 | kcal/mol | IMRE | Larson and McMahon, 1983 | gas phase; These relative affinities are ca. 10 kcal/mol weaker than threshold values (see Wenthold and Squires, 1995) for donors greater than ca. 27 kcal/mol in free energy. This discrepancy has not yet been resolved, though the stronger value appears preferable.; B,M |
By formula: I- + C6H6O = (I- • C6H6O)
Quantity | Value | Units | Method | Reference | Comment |
---|---|---|---|---|---|
ΔrH° | 17.3 ± 1.8 | kcal/mol | IMRE | Paul and Kebarle, 1990 | gas phase; ΔGaff at 423 K; B,M |
Quantity | Value | Units | Method | Reference | Comment |
ΔrS° | 21. | cal/mol*K | N/A | Paul and Kebarle, 1990 | gas phase; Entropy change calculated or estimated; M |
Quantity | Value | Units | Method | Reference | Comment |
ΔrG° | 8.4 ± 1.0 | kcal/mol | IMRE | Paul and Kebarle, 1990 | gas phase; ΔGaff at 423 K; B |
Free energy of reaction
ΔrG° (kcal/mol) | T (K) | Method | Reference | Comment |
---|---|---|---|---|
8.4 | 423. | PHPMS | Paul and Kebarle, 1990 | gas phase; Entropy change calculated or estimated; M |
By formula: K+ + C6H6O = (K+ • C6H6O)
Quantity | Value | Units | Method | Reference | Comment |
---|---|---|---|---|---|
ΔrH° | 17.7 ± 0.8 | kcal/mol | CIDT | Amunugama and Rodgers, 2002 | RCD |
By formula: (K+ • C6H6O) + C6H6O = (K+ • 2C6H6O)
Quantity | Value | Units | Method | Reference | Comment |
---|---|---|---|---|---|
ΔrH° | 16.3 ± 0.8 | kcal/mol | CIDT | Amunugama and Rodgers, 2002 | RCD |
By formula: Li+ + C6H6O = (Li+ • C6H6O)
Quantity | Value | Units | Method | Reference | Comment |
---|---|---|---|---|---|
ΔrH° | 42.6 ± 4.0 | kcal/mol | CIDT | Amunugama and Rodgers, 2002 | RCD |
By formula: (Li+ • C6H6O) + C6H6O = (Li+ • 2C6H6O)
Quantity | Value | Units | Method | Reference | Comment |
---|---|---|---|---|---|
ΔrH° | 27.4 ± 0.8 | kcal/mol | CIDT | Amunugama and Rodgers, 2002 | RCD |
By formula: Na+ + C6H6O = (Na+ • C6H6O)
Quantity | Value | Units | Method | Reference | Comment |
---|---|---|---|---|---|
ΔrH° | 24.4 ± 0.8 | kcal/mol | CIDT | Amunugama and Rodgers, 2002 | RCD |
ΔrH° | 23.5 ± 0.8 | kcal/mol | CIDT | Armentrout and Rodgers, 2000 | RCD |
Free energy of reaction
ΔrG° (kcal/mol) | T (K) | Method | Reference | Comment |
---|---|---|---|---|
16.7 | 298. | IMRE | McMahon and Ohanessian, 2000 | Anchor alanine=39.89; RCD |
By formula: (Na+ • C6H6O) + C6H6O = (Na+ • 2C6H6O)
Quantity | Value | Units | Method | Reference | Comment |
---|---|---|---|---|---|
ΔrH° | 19.5 ± 0.8 | kcal/mol | CIDT | Amunugama and Rodgers, 2002 | RCD |
By formula: Rb+ + C6H6O = (Rb+ • C6H6O)
Quantity | Value | Units | Method | Reference | Comment |
---|---|---|---|---|---|
ΔrH° | 16.6 ± 0.8 | kcal/mol | CIDT | Amunugama and Rodgers, 2002 | RCD |
By formula: (Rb+ • C6H6O) + C6H6O = (Rb+ • 2C6H6O)
Quantity | Value | Units | Method | Reference | Comment |
---|---|---|---|---|---|
ΔrH° | 15.2 ± 0.8 | kcal/mol | CIDT | Amunugama and Rodgers, 2002 | RCD |

References

Cox, 1961
Cox, J.D.,
The heats of combustion of phenol and the three cresols,
Pure Appl. Chem., 1961, 2, 125-128. [all data]
Andon, Biddiscombe, et al., 1960
Andon, R.J.L.; Biddiscombe, D.P.; Cox, J.D.; Handley, R.; Harrop, D.; Herington, E.F.G.; Martin, J.F.,
Thermodynamic properties of organic oxygen compounds. Part I. Preparation and physical properties of pure phenol, cresols, and xylenols,
J. Chem. Soc., 1960, 5246-5254. [all data]
Parks, Manchester, et al., 1954
Parks, G.S.; Manchester, K.E.; Vaughan, L.M.,
Heats of combustion and formation of some alcohols, phenols, and ketones,
J. Chem. Phys., 1954, 22, 2089-2090. [all data]
Badoche, 1941
Badoche, M.,
No 19. - Chaleurs de combustion du phenol, du-m-cresol et del leurs ethers; par M. Marius BADOCHE.,
Bull. Soc. Chim. Fr., 1941, 8, 212-220. [all data]
Kudchadker S.A., 1978
Kudchadker S.A.,
Ideal gas thermodynamic properties of phenol and cresols,
J. Phys. Chem. Ref. Data, 1978, 7, 417-423. [all data]
Evans J.C., 1960
Evans J.C.,
The vibrational spectra phenol and phenol-OD,
Spectrochim. Acta, 1960, 16, 1382-1392. [all data]
Green J.H.S., 1961
Green J.H.S.,
The thermodynamic properties of organic oxygen compounds. II. Vibrational assignment and calculated thermodynamic properties of phenol,
J. Chem. Soc., 1961, 2236-2241. [all data]
Sarin V.N., 1973
Sarin V.N.,
Thermodynamic properties in the gaseous state of certain monosubstituted benzenes,
Thermochim. Acta, 1973, 6, 39-46. [all data]
Ramaswamy V., 1970
Ramaswamy V.,
Thermo data for n-alkyl phenols,
Hydrocarbon Process., 1970, 49, 217-218. [all data]
Bartmess, Scott, et al., 1979
Bartmess, J.E.; Scott, J.A.; McIver, R.T., Jr.,
The gas phase acidity scale from methanol to phenol,
J. Am. Chem. Soc., 1979, 101, 6047. [all data]
Shiner, Vorner, et al., 1986
Shiner, C.S.; Vorner, P.E.; Kass, S.R.,
Gas phase acidities and heats of formation of 2,4- and 2,5- cyclohexadien-1-one, the keto tautomers of phenol,
J. Am. Chem. Soc., 1986, 108, 5699. [all data]
Capponi, Gut, et al., 1999
Capponi, M.; Gut, I.G.; Hellrung, B.; Persy, G.; Wirz, J.,
Ketonization equilibria of phenol in aqueous solution,
Can. J. Chem., 1999, 77, 5-6, 605-613, https://doi.org/10.1139/v99-048
. [all data]
Angel and Ervin, 2004
Angel, L.A.; Ervin, K.M.,
Competitive threshold collision-induced dissociation: Gas-phase acidity and O-H bond dissociation enthalpy of phenol,
J. Phys. Chem. A, 2004, 108, 40, 8346-8352, https://doi.org/10.1021/jp0474529
. [all data]
Cumming and Kebarle, 1978
Cumming, J.B.; Kebarle, P.,
Summary of gas phase measurements involving acids AH. Entropy changes in proton transfer reactions involving negative ions. Bond dissociation energies D(A-H) and electron affinities EA(A),
Can. J. Chem., 1978, 56, 1. [all data]
Richardson, Stephenson, et al., 1975
Richardson, J.H.; Stephenson, L.M.; Brauman, J.I.,
Photodetachment of electrons from phenoxides and thiophenoxide,
J. Am. Chem. Soc., 1975, 97, 2967. [all data]
French, Ikuta, et al., 1982
French, M.A.; Ikuta, S.; Kebarle, P.,
Hydrogen bonding of O-H and C-H hydrogen donors to Cl-. Results from mass spectrometric measurement of the ion-molecule equilibria RH + Cl- = RHCl-,
Can. J. Chem., 1982, 60, 1907. [all data]
Cummings, French, et al., 1977
Cummings, J.B.; French, M.A.; Kebarle, P.,
Effect of charge delocalization on hydrogen bonding to negative ions and solvation of negative ions. Substituted phenols and phenoxide ions,
J. Am. Chem. Soc., 1977, 99, 6999. [all data]
Kebarle, 1977
Kebarle, P.,
Ion Thermochemistry and Solvation from Gas Phase Ion Equilibria,
Ann. Rev. Phys. Chem., 1977, 28, 1, 445, https://doi.org/10.1146/annurev.pc.28.100177.002305
. [all data]
Paul and Kebarle, 1990
Paul, G.J.C.; Kebarle, P.,
Stabilities in the Gas Phase of the Hydrogen Bonded Complexes, YC6H4OH-X-, of Substituted Phenols, YC6H4OH, with the Halide Anions X-(Cl-, Br-),
Can. J. Chem., 1990, 68, 11, 2070, https://doi.org/10.1139/v90-316
. [all data]
Yamdagni and Kebarle, 1971
Yamdagni, R.; Kebarle, P.,
Hydrogen bonding energies to negative ions from gas phase measurements of ionic equilibria,
J. Am. Chem. Soc., 1971, 93, 7139. [all data]
Larson and McMahon, 1983
Larson, J.W.; McMahon, T.B.,
Strong hydrogen bonding in gas-phase anions. An ion cyclotron resonance determination of fluoride binding energetics to bronsted acids from gas-phase fluoride exchange equilibria measurements,
J. Am. Chem. Soc., 1983, 105, 2944. [all data]
Wenthold and Squires, 1995
Wenthold, P.G.; Squires, R.R.,
Bond dissociation energies of F2(-) and HF2(-). A gas-phase experimental and G2 theoretical study,
J. Phys. Chem., 1995, 99, 7, 2002, https://doi.org/10.1021/j100007a034
. [all data]
Arshadi, Yamdagni, et al., 1970
Arshadi, M.; Yamdagni, R.; Kebarle, P.,
Hydration of Halide Negative Ions in the Gas Phase. II. Comparison of Hydration Energies for the Alkali Positive and Halide Negative Ions,
J. Phys. Chem., 1970, 74, 7, 1475, https://doi.org/10.1021/j100702a014
. [all data]
Paul and Kebarle, 1991
Paul, G.J.C.; Kebarle, P.,
Stabilities of Complexes of Br- with Substituted Benzenes (SB) Based on Determinations of the Gas-Phase Equilibria Br- + SB = (BrSB)-,
J. Am. Chem. Soc., 1991, 113, 4, 1148, https://doi.org/10.1021/ja00004a014
. [all data]
Meot-Ner and Sieck, 1986
Meot-Ner, M.; Sieck, L.W.,
The ionic hydrogen bond and ion solvation. 5. OH...O- bonds. Gas phase solvation and clustering of alkoxide and carboxylate anions,
J. Am. Chem. Soc., 1986, 108, 7525. [all data]
Amunugama and Rodgers, 2002
Amunugama, R.; Rodgers, M.T.,
The influence of substituents on cation-pi interactions. 4. Absolute binding energies of alkali metal cation - Phenol complexes determined by threshold collision-induced dissociation and theoretical studies,
J. Phys. Chem. A, 2002, 106, 42, 9718, https://doi.org/10.1021/jp0211584
. [all data]
Armentrout and Rodgers, 2000
Armentrout, P.B.; Rodgers, M.T.,
An Absolute Sodium Cation Affinity Scale: Threshold Collision-Induced Dissociation Experiments and ab Initio Theory,
J. Phys. Chem A, 2000, 104, 11, 2238, https://doi.org/10.1021/jp991716n
. [all data]
McMahon and Ohanessian, 2000
McMahon, T.B.; Ohanessian, G.,
An Experimental and Ab Initio Study of the Nature of the Binding in Gas-Phase Complexes of Sodium Ions,
Chem. Eur. J., 2000, 6, 16, 2931, https://doi.org/10.1002/1521-3765(20000818)6:16<2931::AID-CHEM2931>3.0.CO;2-7
. [all data]
Nesterova, Pimerzin, et al., 1989
Nesterova, T.N.; Pimerzin, A.A.; Rozhnov, A.M.; Karlina, T.N.,
Equilibria for the isomerization of (secondary-alkyl)phenols and cyclohexylphenols,
J. Chem. Thermodyn., 1989, 21, 385-395. [all data]
Nesterova, Pilyshchikov, et al., 1983
Nesterova, T.N.; Pilyshchikov, V.A.; Rozhnov, A.M.,
Chemical Equilibrium in the system isopropylphenols-phenol,
J. Appl. Chem. USSR, 1983, 56, 1257-1261. [all data]
Dias, Salema, et al., 1981
Dias, A.R.; Salema, M.S.; Martinho Simões, J.A.,
J. Organometal. Chem., 1981, 222, 69. [all data]
Calhorda, Carrondo, et al., 1986
Calhorda, M.J.; Carrondo, M.A.A.F.C.T.; Dias, A.R.; Domingos, A.M.T.S.; Martinho Simões, J.A.; Teixeira, C.,
Organometallics, 1986, 5, 660. [all data]
Holm, 1983
Holm, T.,
Acta Chem. Scand. B, 1983, 37, 797. [all data]
Schock and Marks, 1988
Schock, L.E.; Marks, T.J.,
J. Am. Chem. Soc., 1988, 110, 7701. [all data]
Wadso, 1960
Wadso, I.,
Heats of hydrolysis of phenyl acetate and phenyl thiolacetate,
Acta Chem. Scand., 1960, 14, 561-565. [all data]
Leal, Pires de Matos, et al., 1991
Leal, J.P.; Pires de Matos, A.; Martinho Simões, J.A.,
J. Organometal. Chem., 1991, 403, 1. [all data]
Pil'shchikov, Nesterova, et al., 1981
Pil'shchikov, V.A.; Nesterova, T.N.; Rozhnov, A.M.,
Equilibrium in the system phenol-tert-butylphenols,
J. Appl. Chem. USSR, 1981, 54, 1765-1769. [all data]
Diogo, Simoni, et al., 1993
Diogo, H.P.; Simoni, J.A.; Minas da Piedade, M.E.; Dias, A.R.; Martinho Simões, J.A.,
J. Am. Chem. Soc., 1993, 115, 2764. [all data]
Kukui, Potolovskii, et al., 1973
Kukui, N.M.; Potolovskii, L.A.; Vasileva, V.N.,
Thermochemical and thermodynamic calculation of the alkylation of phenol by normal α-olefins,
Khim. Tekhnol. Topl. Masel, 1973, 18, 10-13. [all data]
Verevkin, 1982
Verevkin, S.P.,
Study of equilibrium of tert-butylphenol dealkylation in the gas phase,
Termodin. Organ. Soedin., 1982, 67-70. [all data]
Howe, Mullins, et al., 1987
Howe, G.B.; Mullins, M.E.; Rogers, T.N.,
, Evaluation and Prediction of Henry's Law Constants and Aqueous Sol. for Solvents and Hydrocarbon Fuel Comp. NTIS Rep. ELS-86-66, 1987. [all data]
Berezkin, Popova, et al., 1997
Berezkin, V.G.; Popova, T.P.; Shiryayeva, V.Ye.; Nomura, N.,
Gas-chromatographic separation of monoalkylphenols on polar and non-polar phases by means of capillary chromatography,
Pet. Chem. USSR (Engl. Transl.), 1997, 37, 2, 161-167. [all data]
Zhang, Chen, et al., 1997
Zhang, M.; Chen, B.; Shen, S.; Chen, S.,
Compositional studies of high-temperature coal tar by g.c.-FT-i.r. analysis of middle oil fractions,
Fuel, 1997, 76, 5, 415-423, https://doi.org/10.1016/S0016-2361(97)85518-4
. [all data]
Righezza, Hassani, et al., 1996
Righezza, M.; Hassani, A.; Meklati, B.Y.; Chrétien, J.R.,
Quantitative structure-retention relationships (QSRR) of congeneric aromatics series studied on phenyl OV phases in gas chromatography,
J. Chromatogr. A, 1996, 723, 1, 77-91, https://doi.org/10.1016/0021-9673(95)00816-0
. [all data]
Hassani and Meklati, 1992
Hassani, A.; Meklati, B.Y.,
Gas chromatographic behaviour of monosubstituted benzenes, benzaldehydes and acetophenones on OV polymethylphenyl-silicone stationary phases,
Chromatographia, 1992, 33, 5/6, 267-271, https://doi.org/10.1007/BF02276193
. [all data]
Zhang, Li, et al., 1992
Zhang, M.J.; Li, S.D.; Chen, B.J.,
Compositional studies of high-temperature coal tar by GC/FTIR analysis of light oil fractions,
Chromatographia, 1992, 33, 3/4, 138-146, https://doi.org/10.1007/BF02275894
. [all data]
Evans and Haken, 1989
Evans, M.B.; Haken, J.K.,
Dispersion and selectivity indices in gas chromatography. IV. Chlorinated aromatic compounds,
J. Chromatogr., 1989, 468, 373-382, https://doi.org/10.1016/S0021-9673(00)96332-5
. [all data]
Engewald, Billing, et al., 1988
Engewald, W.; Billing, U.; Topalova, I.; Petsev, N.,
Structure-retention correlations of alkylphenols in gas-liquid and gas-solid chromatography,
J. Chromatogr., 1988, 446, 71-77, https://doi.org/10.1016/S0021-9673(00)94419-4
. [all data]
Shakirov, Tsypysheva, et al., 1988
Shakirov, L.G.; Tsypysheva, L.G.; Suleimamova, R.A.; Naimushin, A.I.; Tsypyshev, O.Yu.,
Gas chromatographic determination of the products of the synthesis of chlorine-substituted salicylic acids,
Zh. Anal. Khim., 1988, 43, 143-146. [all data]
Korhonen and Knuutinen, 1984
Korhonen, I.O.O.; Knuutinen, J.,
Gas-liquid chromatographic analyses. XXVII. Separation of chlorinated 4-hydroxybenzaldehydes on a capillary column coated with non-polar SE-30 stationary phase,
J. Chromatogr., 1984, 292, 2, 345-353, https://doi.org/10.1016/S0021-9673(01)83614-1
. [all data]
Korhonen, 1984
Korhonen, I.O.O.,
Gas-liquid chromatographic analyses. XXXI. Retention increments of isomeric chlorophenols on low-polarity (SE-30) and polar (FFAP) capillary columns,
J. Chromatogr., 1984, 315, 185-200, https://doi.org/10.1016/S0021-9673(01)90736-8
. [all data]
Tiess, 1984
Tiess, D.,
Gaschromatographische Retentionsindices von 125 leicht- bis mittelflüchtigen organischen Substanzen toxikologisch-analytischer Relevanz auf SE-30,
Wiss. Z. Wilhelm-Pieck-Univ. Rostock Math. Naturwiss. Reihe, 1984, 33, 6-9. [all data]
Winskowski, 1983
Winskowski, J.,
Gaschromatographische Identifizierung von Stoffen anhand von Indexziffem und unterschiedlichen Detektoren,
Chromatographia, 1983, 17, 3, 160-165, https://doi.org/10.1007/BF02271041
. [all data]
Zygmunt, Wardencki, et al., 1983
Zygmunt, B.; Wardencki, W.; Staszewski, R.,
Gas chromatographic identification of thiols in the naphta cut from Libyan crude oil,
J. Chromatogr., 1983, 265, 136-138, https://doi.org/10.1016/S0021-9673(01)96709-3
. [all data]
Vernon and Edwards, 1975
Vernon, F.; Edwards, G.T.,
Gas-liquid chromatography on fluorinated stationary phases. II. Fluorinated compounds containing a functional group,
J. Chromatogr., 1975, 114, 1, 87-93, https://doi.org/10.1016/S0021-9673(00)85245-0
. [all data]
Agr, Tesaric, et al., 1973
Agr, X.X.; Tesaric, K.; Janak, J.,
Will be entered later,
J. Chromatogr., 1973, 95, 207-215. [all data]
Mitchell and Vernon, 1972
Mitchell, P.T.; Vernon, F.,
Gas-Liquid Chromatography of Nitrophenols and Methyl Derivatives,
J. Chromatogr., 1972, 65, 3, 487-491, https://doi.org/10.1016/S0021-9673(00)84994-8
. [all data]
Tibor and Anna, 1971
Tibor, T.; Anna, B.,
Gázkromatográfiás retenció és a kémiai szerkezet, I.,
Magy. Kem. Foly., 1971, 77, 576-587. [all data]
Brown, Chapman, et al., 1968
Brown, I.; Chapman, I.L.; Nicholson, G.J.,
Gas chromatography of polar solutes in electron acceptor stationary phases,
Aust. J. Chem., 1968, 21, 5, 1125-1141, https://doi.org/10.1071/CH9681125
. [all data]
Reymond, Mueggler-Chavan, et al., 1966
Reymond, D.; Mueggler-Chavan, F.; Viani, R.; Vuataz, L.; Egli, R.H.,
Gas chromatographic analysis of steam volatile aroma constituents: application to coffee, tea and cocoa aromas,
J. Gas Chromatogr., 1966, 4, 1, 28-31, https://doi.org/10.1093/chromsci/4.1.28
. [all data]
Viani, Müggler-Chavan, et al., 1965
Viani, R.; Müggler-Chavan, F.; Reymond, D.; Egli, R.H.,
196. Sur la composition de l'arôme de café,
Helv. Chim. Acta, 1965, 48, 195-196, 1809-1815, https://doi.org/10.1002/hlca.19650480743
. [all data]
Medvedovskaya, Tikhomirova, et al., 1997
Medvedovskaya, I.I.; Tikhomirova, S.V.; Krasavina, T.D.; Gubkina, L.N.,
Comparison of results of chromatographic identification of complex mixtures of organic compounds,
Proc. Omsk. Univ., 1997, 4, 34-36. [all data]
Still and Whitehead, 1977
Still, R.H.; Whitehead, A.,
Thermal degradation of polymers. XV. Vacuum pyrolysis studies on poly(p-methoxystyrene) and poly(p-hydroxystyrene),
J. Appl. Polym. Sci., 1977, 21, 5, 1199-1213, https://doi.org/10.1002/app.1977.070210504
. [all data]
Anderson, Jurel, et al., 1973
Anderson, A.; Jurel, S.; Shymanska, M.; Golender, L.,
Gas-liquid chromatography of some aliphatic and heterocyclic mono- and pollyfunctional amines. VII. Retention indices of amines in some polar and unpolar stationary phases,
Latv. PSR Zinat. Akad. Vestis Kim. Ser., 1973, 1, 51-63. [all data]
Ádámová, Orinák, et al., 2005
Ádámová, M.; Orinák, A.; Halás, L.,
Retention indices as identification tool in pyrolysis-capillary gas chromatography,
J. Chromatogr. A, 2005, 1087, 1-2, 131-141, https://doi.org/10.1016/j.chroma.2005.01.003
. [all data]
Hierro, de la Hoz, et al., 2004
Hierro, E.; de la Hoz, L.; Ordóñez, J.A.,
Headspace volatile compounds from salted and occasionally smoked dried meats (cecinas) as affected by animal species,
Food Chem., 2004, 85, 4, 649-657, https://doi.org/10.1016/j.foodchem.2003.07.001
. [all data]
Lalel, Singh, et al., 2003
Lalel, H.J.D.; Singh, Z.; Chye Tan, S.,
Glycosidically-bound aroma volatile compounds in the skin and pulp of 'Kensington Pride' mango fruit at different stages of maturity,
Postharvest Biol. Technol., 2003, 29, 2, 205-218, https://doi.org/10.1016/S0925-5214(02)00250-8
. [all data]
Sun and Stremple, 2003
Sun, G.; Stremple, P.,
Retention index characterization of flavor, fragrance, and many other compounds on DB-1 and DB-XLB, 2003, retrieved from http://www.chem.agilent.com/cag/cabu/pdf/b-0279.pdf. [all data]
Xu, van Stee, et al., 2003
Xu, X.; van Stee, L.L.P.; Williams, J.; Beens, J.; Adahchour, M.; Vreuls, R.J.J.; Brinkman, U.A.Th.; Lelieveld, J.,
Comprehensive two-dimensional gas chromatography (GC×GC) measurements of volatile organic compounds in the atmosphere,
Atmos. Chem. Phys., 2003, 3, 3, 665-682, https://doi.org/10.5194/acp-3-665-2003
. [all data]
Pino, Marbot, et al., 2002
Pino, J.A.; Marbot, R.; Bello, A.,
Volatile compounds of Psidium salutare (H.B.K.) Berg. fruit,
J. Agric. Food Chem., 2002, 50, 18, 5146-5148, https://doi.org/10.1021/jf0116303
. [all data]
Kim, 2001
Kim, J.S.,
Einfluss der Temperatur beim Rösten von Sesam auf Aroma und antioxidative Eigenschaften des Öls, PhD Thesis, Technischen Universität Berlin zur Erlangung des akademischen Grades, Berlin, 2001, 151. [all data]
de Lacy Costello, Evans, et al., 2001
de Lacy Costello, B.P.J.; Evans, P.; Ewen, R.J.; Gunson, H.E.; Jones, P.R.H.; Ratcliffe, N.M.; Spencer-Phillips, P.T.N.,
Gas chromatography-mass spectrometry analyses of volatile organic compounds from potato tubers inoculated with Phytophthora infestans or Fusarium coeruleum,
Plant Pathol., 2001, 50, 4, 489-496, https://doi.org/10.1046/j.1365-3059.2001.00594.x
. [all data]
Yin, Xiu, et al., 2001
Yin, W.; Xiu, Z.; Aijin, H.,
Analysis of the volatile components in trogopterorum feces by capillary gas chromatography and gas chromatography/mass spectrometry,
Fenxi Huaxue, 2001, 29, 2, 195-198. [all data]
Chevance and Farmer, 1999
Chevance, F.F.V.; Farmer, L.J.,
Identification of major volatile odor compounds in frankfurters,
J. Agric. Food Chem., 1999, 47, 12, 5151-5160, https://doi.org/10.1021/jf990515d
. [all data]
Helmig, Klinger, et al., 1999
Helmig, D.; Klinger, L.F.; Guenther, A.; Vierling, L.; Geron, C.; Zimmerman, P.,
Biogenic volatile organic compound emissions (BVOCs). I. Identifications from three continental sites in the U.S.,
Chemosphere, 1999, 38, 9, 2163-2187, https://doi.org/10.1016/S0045-6535(98)00425-1
. [all data]
Verdier-Metz., Coulon, et al., 1998
Verdier-Metz., I.; Coulon, J.-B.; PPradel, P.; Viallon, C.; Berdague, J.-L.,
Effect of forage conservation (hay or silage) and cow breed on the coagulation properties of milks and on the characteristics of ripened cheeses,
J. Dairy Res., 1998, 65, 1, 9-21, https://doi.org/10.1017/S0022029997002616
. [all data]
DeMilo, Lee, et al., 1996
DeMilo, A.B.; Lee, C.-J.; Moreno, D.S.; Martinez, A.J.,
Identification of volatiles derived from Citrobacter freundii fermentation of a trypticase soy broth,
J. Agric. Food Chem., 1996, 44, 2, 607-612, https://doi.org/10.1021/jf950525o
. [all data]
Gautzsch and Zinn, 1996
Gautzsch, R.; Zinn, P.,
Use of incremental models to estimate the retention indexes of aromatic compounds,
Chromatographia, 1996, 43, 3/4, 163-176, https://doi.org/10.1007/BF02292946
. [all data]
Helmig, Pollock, et al., 1996
Helmig, D.; Pollock, W.; Greenberg, J.; Zimmerman, P.,
Gas chromatography mass spectrometry analysis of volatile organic trace gases at Mauna Loa Observatory, Hawaii,
J. Geophys. Res., 1996, 101, D9, 14697-14710, https://doi.org/10.1029/96JD00212
. [all data]
Coen, Engel, et al., 1995
Coen, M.; Engel, R.; Nahrstedt, A.,
Chavicol β-D-glucoside, a phenylpropanoid heteroside, benzyl-β-D-glucoside and glycosidically bound volatiles from subspecies of Cedronella canariensis,
Phytochemistry, 1995, 40, 1, 149-155, https://doi.org/10.1016/0031-9422(95)00241-X
. [all data]
Gerbino and Castello, 1995
Gerbino, T.C.; Castello, G.,
Prediction of programmed temperature retention indices on capillary columns of different polarities,
J. Chromatogr. A, 1995, 699, 1-2, 161-171, https://doi.org/10.1016/0021-9673(95)00024-H
. [all data]
Lee, DeMilo, et al., 1995
Lee, C.-J.; DeMilo, A.B.; Moreno, D.S.; Martinez, A.J.,
Analysis of the volatile components of a bacterial fermentation that is attractive to the Mexican fruit fly, Anastrepha ludens,
J. Agric. Food Chem., 1995, 43, 5, 1348-1351, https://doi.org/10.1021/jf00053a041
. [all data]
Ferchichi and Messadi, 1994
Ferchichi, L.; Messadi, D.,
Simulations de la rétention et de l'effecacité de colonne en chromatographie en phase gazeuse à température programmée: théorie et application,
Analusis, 1994, 22, 392-399. [all data]
Kaiser and Siegl, 1994
Kaiser, E.W.; Siegl, W.O.,
High resolution gas chromatographic determination of the atmospheric reactivity of engine-out hydrocarbon emissions from a spark-ignited engine,
J. Hi. Res. Chromatogr., 1994, 17, 4, 264-270, https://doi.org/10.1002/jhrc.1240170414
. [all data]
Wu, Kuo, et al., 1991
Wu, P.; Kuo, M.-C.; Hartman, T.G.; Rosen, R.T.; Ho, C.-T.,
Free and glycosidically bound aroma compounds in pineapple (Ananas comosus L. Merr.),
J. Agric. Food Chem., 1991, 39, 1, 170-172, https://doi.org/10.1021/jf00001a033
. [all data]
Shapi and Hesso, 1990
Shapi, M.M.; Hesso, A.,
Thermal decomposition of polystyrene volatile compounds from large-scale pyrolysis,
J. Anal. Appl. Pyrolysis, 1990, 18, 2, 143-161, https://doi.org/10.1016/0165-2370(90)80004-8
. [all data]
Tang, Zhang, et al., 1990
Tang, J.; Zhang, Y.; Hartman, T.G.; Rosen, R.T.; Ho, C.-T.,
Free and glycosidically bound volatile compounds in fresh celery (Apium graveolens L.),
J. Agric. Food Chem., 1990, 38, 10, 1937-1940, https://doi.org/10.1021/jf00100a013
. [all data]
Sagrero-Nieves, de Pooter, et al., 1989
Sagrero-Nieves, L.; de Pooter, H.L.; Van Wassenhove, F.A.,
Major Volatile Constituents from the Fruit of Mammee Apple (Mammea americana L.),
J. Food Comp. Anal., 1989, 2, 4, 382-385, https://doi.org/10.1016/0889-1575(89)90010-0
. [all data]
Tan, Wilkins, et al., 1989
Tan, S.T.; Wilkins, A.L.; Holland, P.T.; McGhie, T.K.,
Extractives from New Zealand unifloral honeys. 2. Degraded carotenoids and other substances from heather honey,
J. Agric. Food Chem., 1989, 37, 5, 1217-1221, https://doi.org/10.1021/jf00089a004
. [all data]
Peng, Ding, et al., 1988
Peng, C.T.; Ding, S.F.; Hua, R.L.; Yang, Z.C.,
Prediction of Retention Indexes I. Structure-Retention Index Relationship on Apolar Columns,
J. Chromatogr., 1988, 436, 137-172, https://doi.org/10.1016/S0021-9673(00)94575-8
. [all data]
Rostad and Pereira, 1986
Rostad, C.E.; Pereira, W.E.,
Kovats and Lee retention indices determined by gas chromatography/mass spectrometry for organic compounds of environmental interest,
J. Hi. Res. Chromatogr. Chromatogr. Comm., 1986, 9, 6, 328-334, https://doi.org/10.1002/jhrc.1240090603
. [all data]
Buchman, Cao, et al., 1984
Buchman, O.; Cao, G.-Y.; Peng, C.T.,
Structure assignment by retention index in gas-liquid radiochromatography of substituted cyclohexenes,
J. Chromatogr., 1984, 312, 75-90, https://doi.org/10.1016/S0021-9673(01)92765-7
. [all data]
Varlet, Serot, et al., 2007
Varlet, V.; Serot, T.; Cardinal, M.; Knockaert, C.; Prost, C.,
Olfactometric Determination of the Most Potent Odor-Active Compounds in Salmon Muscle (Salmo salar) Smoked by Using Four Smoke Generation Techniques,
J. Agric. Food Chem., 2007, 55, 11, 4518-4525, https://doi.org/10.1021/jf063468f
. [all data]
Mjøs, Meier, et al., 2006
Mjøs, S.A.; Meier, S.; Boitsov, S.,
Alkylphenol retention indices,
J. Chromatogr. A, 2006, 1123, 1, 98-105, https://doi.org/10.1016/j.chroma.2006.05.002
. [all data]
Varlet V., Knockaert C., et al., 2006
Varlet V.; Knockaert C.; Prost C.; Serot T.,
Comparison of odor-active volatile compounds of fresh and smoked salmon,
J. Agric. Food Chem., 2006, 54, 9, 3391-3401, https://doi.org/10.1021/jf053001p
. [all data]
Place, Imhof, et al., 2003
Place, R.B.; Imhof, M.; Teuber, M.; Olivier Bosset, J.,
Distribution of the volatile (flavour) compounds in Raclette cheese produced with different staphylococci in the smear,
Mitt. Lebensmittelunters. Hyg., 2003, 94, 192-211. [all data]
Whetstine, Parker, et al., 2003
Whetstine, M.E.C.; Parker, J.D.; Drake, M.A.; Larick, D.K.,
Determining flavor and flavor variability in commercially produced liquid cheddar whey,
J. Dairy Sci., 2003, 86, 2, 439-448, https://doi.org/10.3168/jds.S0022-0302(03)73622-4
. [all data]
Yasuhara, Shiraishi, et al., 1997
Yasuhara, A.; Shiraishi, H.; Nishikawa, M.; Yamamoto, T.; Uehiro, T.; Nakasugi, O.; Okumura, T.; Kenmotsu, K.; Fukui, H.; Nagase, M.; Ono, Y.; Kawagoshi, Y.; Baba, K.; Noma, Y.,
Determination of organic components in leachates from hazardous waste disposal sites in Japan by gas chromatography-mass spectrometry,
J. Chromatogr. A, 1997, 774, 1-2, 321-332, https://doi.org/10.1016/S0021-9673(97)00078-2
. [all data]
Peng, Yang, et al., 1991
Peng, C.T.; Yang, Z.C.; Maltby, D.,
Prediction of retention indexes. III. Silylated derivatives of polar compounds,
J. Chromatogr., 1991, 586, 1, 113-129, https://doi.org/10.1016/0021-9673(91)80029-G
. [all data]
Jarunrattanasri, Theerakulkait, et al., 2007
Jarunrattanasri, A.; Theerakulkait, C.; Cadwallader, K.R.,
Aroma Components of Acid-Hydrolyzed Vegetable Protein Made by Partial Hydrolysis of Rice Bran Protein,
J. Agric. Food Chem., 2007, 55, 8, 3044-3050, https://doi.org/10.1021/jf0631474
. [all data]
Pozo-Bayon M.A., Ruiz-Rodriguez A., et al., 2007
Pozo-Bayon M.A.; Ruiz-Rodriguez A.; Pernin K.; Cayot N.,
Influence of eggs on the aroma composition of a sponge cake and on the aroma release in model studies on flavored sponge cakes,
J. Agric. Food Chem., 2007, 55, 4, 1418-1426, https://doi.org/10.1021/jf062203y
. [all data]
Osorio, Alarcon, et al., 2006
Osorio, C.; Alarcon, M.; Moreno, C.; Bonilla, A.; Barrios, J.; Garzon, C.; Duque, C.,
Characterization of Odor-Active Volatiles in Champa ( Campomanesia lineatifolia R. P.),
J. Agric. Food Chem., 2006, 54, 2, 509-516, https://doi.org/10.1021/jf052098c
. [all data]
Chung, Fung, et al., 2005
Chung, H.Y.; Fung, P.K.; Kim, J.-S.,
Aroma impact components in commercial plain sufu,
J. Agric. Food Chem., 2005, 53, 5, 1684-1691, https://doi.org/10.1021/jf048617d
. [all data]
Cros, Lignot, et al., 2005
Cros, S.; Lignot, B.; Bourseau, P.; Jaouen, P.; Prost, C.,
Desalination of mussel cooking juices by electrodialysis: effect on the aroma profile,
J. Food Eng., 2005, 69, 4, 425-436, https://doi.org/10.1016/j.jfoodeng.2004.08.036
. [all data]
Lee, Lee, et al., 2005
Lee, J.-G.; Lee, C.-G.; Kwag, J.-J.; Buglass, A.J.; Lee, G.-H.,
Determination of optimum conditions for the analysis of volatile components in pine needles by double-shot pyrolysis-gas chromatography-mass spectrometry,
J. Chromatogr. A, 2005, 1089, 1-2, 227-234, https://doi.org/10.1016/j.chroma.2005.06.060
. [all data]
Bonvehi and Coll, 2003
Bonvehi, J.S.; Coll, F.V.,
Flavour index and aroma profiles of fresh and processed honeys,
J. Sci. Food Agric., 2003, 83, 4, 275-282, https://doi.org/10.1002/jsfa.1308
. [all data]
Chyau, Ko, et al., 2003
Chyau, C.-C.; Ko, P.-T.; Chang, C.-H.; Mau, J.-L.,
Free and glycosidically bound aroma compounds in lychee (Litchi chinensis Sonn.),
Food Chem., 2003, 80, 3, 387-392, https://doi.org/10.1016/S0308-8146(02)00278-9
. [all data]
Cros, Vandanjon, et al., 2003
Cros, S.; Vandanjon, L.; Jaouen, P.; Bourseau, P.,
Processing of industrial mussel cooking juices by reverse osmosis: pollution abatement and aromas recovery, 2003, retrieved from http://www.membrane.unsw.edu.au/imstec03/content/papers/DAI/imstec064.pdf. [all data]
Chung, Yung, et al., 2002
Chung, H.-Y.; Yung, I.K.S.; Ma, W.C.J.; Kim, J.-S.,
Analysis of volatile components in frozen and dried scallops (Patinopecten yessoensis) by gas chromatography/mass spectrometry,
Food Res. Int., 2002, 35, 1, 43-53, https://doi.org/10.1016/S0963-9969(01)00107-7
. [all data]
Adamiec, Rossner, et al., 2001
Adamiec, J.; Rossner, J.; Velisek, J.; Cejpek, K.; Savel, J.,
Minor Strecker degradation products of phenylalanine and phenylglycine,
Eur. Food Res. Technol., 2001, 212, 2, 135-140, https://doi.org/10.1007/s002170000234
. [all data]
Chung, Yung, et al., 2001
Chung, H.Y.; Yung, I.K.S.; Kim, J.-S.,
Comparison of volatile components in dried scallops (Chlamys farreri and Patinopecten yessoensis) prepared by boiling and steaming methods,
J. Agric. Food Chem., 2001, 49, 1, 192-202, https://doi.org/10.1021/jf000692a
. [all data]
Shimoda, Yoshimura, et al., 2001
Shimoda, M.; Yoshimura, Y.; Yoshimura, T.; Noda, K.; Osajima, Y.,
Volatile flavor compounds of sweetened condensed milk,
J. Food Sci., 2001, 66, 6, 804-807, https://doi.org/10.1111/j.1365-2621.2001.tb15176.x
. [all data]
Wirth, Guo, et al., 2001
Wirth, J.; Guo, W.; Baumes, R.; Günata, Z.,
Volatile compounds released by enzymatic hydrolysis of glycoconjugates of leaves and grape berries from Vitis vinifera muscat of Alexandria and Shiraz cultivars,
J. Agric. Food Chem., 2001, 49, 6, 2917-2923, https://doi.org/10.1021/jf001398l
. [all data]
Bureau, Baumes, et al., 2000
Bureau, S.M.; Baumes, R.L.; Razungles, A.J.,
Effects of vine or bunch shading on the glycosylated flavor precursors in grapes of Vitis vinifera L. Cv. Syrah,
J. Agric. Food Chem., 2000, 48, 4, 1290-1297, https://doi.org/10.1021/jf990507x
. [all data]
Chung, 2000
Chung, H.Y.,
Volatile flavor components in red fermented soybean (Glycine max) curds,
J. Agric. Food Chem., 2000, 48, 5, 1803-1809, https://doi.org/10.1021/jf991272s
. [all data]
Chevance and Farmer, 1999, 2
Chevance, F.F.V.; Farmer, L.J.,
Release of volatile odor compounds from full-fat and reduced-fat frankfurters,
J. Agric. Food Chem., 1999, 47, 12, 5161-5168, https://doi.org/10.1021/jf9905166
. [all data]
Chung, 1999
Chung, H.Y.,
Volatile components in crabmeats of Charybdis feriatus,
J. Agric. Food Chem., 1999, 47, 6, 2280-2287, https://doi.org/10.1021/jf981027t
. [all data]
Chung, 1999, 2
Chung, H.Y.,
Volatile components in fermented soybean (Glycine max) curds,
J. Agric. Food Chem., 1999, 47, 7, 2690-2696, https://doi.org/10.1021/jf981166a
. [all data]
Ollé, Baumes, et al., 1998
Ollé, D.; Baumes, R.L.; Bayonove, C.L.; Lozano, Y.F.; Sznaper, C.; Brillouet, J.-M.,
Comparison of free and glycosidically linked volatile components from polyembryonic and monoembryonic mango (Mangifera indica L.) cultivars,
J. Agric. Food Chem., 1998, 46, 3, 1094-1100, https://doi.org/10.1021/jf9705781
. [all data]
Shiratsuchi, Shimoda, et al., 1994
Shiratsuchi, H.; Shimoda, M.; Imayoshi, K.; Noda, K.; Osajima, Y.,
Volatile flavor compounds in spray-dried skim milk powder,
J. Agric. Food Chem., 1994, 42, 4, 984-988, https://doi.org/10.1021/jf00040a028
. [all data]
Sumitani, Suekane, et al., 1994
Sumitani, H.; Suekane, S.; Nakatani, A.; Tatsuka, K.,
Changes in composition of volatile compounds in high pressure treated peach,
J. Agric. Food Chem., 1994, 42, 3, 785-790, https://doi.org/10.1021/jf00039a037
. [all data]
Chung and Cadwallader, 1993
Chung, H.Y.; Cadwallader, K.R.,
Volatile components in blue crab (Callinectes sapidus) meat and processing by-product,
J. Food Sci., 1993, 58, 6, 1203-1207, https://doi.org/10.1111/j.1365-2621.1993.tb06148.x
. [all data]
Umano, Hagi, et al., 1992
Umano, K.; Hagi, Y.; Nakahara, K.; Shoji, A.; Shibamoto, T.,
Volatile constituents of green and ripened pineapple (Aanas comosus [L.] Merr.),
J. Agric. Food Chem., 1992, 40, 4, 599-603, https://doi.org/10.1021/jf00016a014
. [all data]
Humpf and Schreier, 1991
Humpf, H.-U.; Schreier, P.,
Bound aroma compounds from the fruit and the leaves of blackberry (Rubus laciniata L.),
J. Agric. Food Chem., 1991, 39, 10, 1830-1832, https://doi.org/10.1021/jf00010a028
. [all data]
Krammer, Winterhalter, et al., 1991
Krammer, G.; Winterhalter, P.; Schwab, M.; Schreier, P.,
Glycosidically bound aroma compounds in the fruits of Prunus species: Apricot (P. armeniaca, L.) peach (P. persica, L.) yellow plum (P. domestica, L. ssp. Syriaca),
J. Agric. Food Chem., 1991, 39, 4, 778-781, https://doi.org/10.1021/jf00004a032
. [all data]
Pabst, Barron, et al., 1991
Pabst, A.; Barron, D.; Etiévant, P.; Schreier, P.,
Studies on the enzymatic hydrolysis of bound aroma constituents from raspberry fruit pulp,
J. Agric. Food Chem., 1991, 39, 1, 173-175, https://doi.org/10.1021/jf00001a034
. [all data]
Suárez, Duque, et al., 1991
Suárez, M.; Duque, C.; Wintoch, H.; Schreier, P.,
Glycosidically bound aroma compounds from the pulp and the peelings of lulo fruit (Solanum vestissimum D.),
J. Agric. Food Chem., 1991, 39, 9, 1643-1645, https://doi.org/10.1021/jf00009a022
. [all data]
Frohlich and Schreier, 1990
Frohlich, O.; Schreier, P.,
Volatile Constituents of Loquat (Eriobotrya japonica Lindl.) Fruit,
J. Food Sci., 1990, 55, 1, 176-180, https://doi.org/10.1111/j.1365-2621.1990.tb06046.x
. [all data]
Schwab, Mahr, et al., 1989
Schwab, W.; Mahr, C.; Schreier, P.,
Studies on the enzymic hydrolysis of bound aroma components from Carica papaya fruit,
J. Agric. Food Chem., 1989, 37, 4, 1009-1012, https://doi.org/10.1021/jf00088a042
. [all data]
Tanchotikul and Hsieh, 1989
Tanchotikul, U.; Hsieh, T.C.-Y.,
Volatile Flavor Components in Crayfish Waste,
J. Food Sci., 1989, 54, 6, 1515-1520, https://doi.org/10.1111/j.1365-2621.1989.tb05149.x
. [all data]
Baltes and Mevissen, 1988
Baltes, W.; Mevissen, L.,
Model reactions on roast aroma formation. VI. Volatile reaction products from the reaction of phenylalanine with glucose during cooking and roasting,
Z. Lebensm. Unters. Forsch., 1988, 187, 3, 209-214, https://doi.org/10.1007/BF01043341
. [all data]
Wang and Sun, 1987
Wang, T.; Sun, Y.,
On the influence of the solute sample size on temperature-programmed retention indices,
J. Hi. Res. Chromatogr. Chromatogr. Comm., 1987, 10, 11, 603-606, https://doi.org/10.1002/jhrc.1240101105
. [all data]
Natali N., Chinnici F., et al., 2006
Natali N.; Chinnici F.; Riponi C.,
Characterization of volatiles in extracts from oak chips obtained by accelerated solvent extraction (ASE),
J. Agric. Food Chem., 2006, 54, 21, 8190-8198, https://doi.org/10.1021/jf0614387
. [all data]
Verzera, Ziino, et al., 2004
Verzera, A.; Ziino, M.; Condurso, C.; Romeo, V.; Zappala, M.,
Solid-phase microextraction and gas chromatography-mass spectrometry for rapid characterisation of semi-hard cheeses,
Anal. Bioanal. Chem., 2004, 380, 7-8, 930-936, https://doi.org/10.1007/s00216-004-2879-4
. [all data]
Pennarun, Prost, et al., 2003
Pennarun, A.-L.; Prost, C.; Haure, J.; Demaimay, M.,
Comparison of two microalgal diets. 2. Influence on odorant composition and organoleptic qualities of raw oysters (Crassostrea gigas),
J. Agric. Food Chem., 2003, 51, 7, 2011-2018, https://doi.org/10.1021/jf020549c
. [all data]
Pennarun, Prost, et al., 2002
Pennarun, A.L.; Prost, C.; Demaimay, M.,
Identification and origin of the character-impact compounds of raw oyster Crassostrea gigas,
J. Sci. Food Agric., 2002, 82, 14, 1652-1660, https://doi.org/10.1002/jsfa.1236
. [all data]
Cantergiani, Brevard, et al., 2001
Cantergiani, E.; Brevard, H.; Krebs, Y.; Feria-Morales, A.; Amadò, R.; Yeretzian, C.,
Characterisation of the aroma of green Mexican coffee and identification of mouldy/earthy defect,
Eur. Food Res. Technol., 2001, 212, 6, 648-657, https://doi.org/10.1007/s002170100305
. [all data]
Baek and Cadwallader, 1996
Baek, H.H.; Cadwallader, K.R.,
Volatile compounds in flavor concentrates produced from crayfish-processing byproducts with and without protease treatment,
J. Agric. Food Chem., 1996, 44, 10, 3262-3267, https://doi.org/10.1021/jf960023q
. [all data]
Yasuhara, 1987
Yasuhara, A.,
Identification of Volatile Compounds in Poultry Manure by Gas Chromatography-Mass Spectrometry,
J. Chromatogr., 1987, 387, 371-378, https://doi.org/10.1016/S0021-9673(01)94539-X
. [all data]
Whitfield, Shea, et al., 1981
Whitfield, F.B.; Shea, S.R.; Gillen, K.J.; Shaw, K.J.,
Volatile components from the roots of Acacia pulchella R.Br. and their effect on Phytophthora cinnamomi rands,
Aust. J. Bot., 1981, 29, 2, 195-208, https://doi.org/10.1071/BT9810195
. [all data]
Hedin, Minyard, et al., 1967
Hedin, P.A.; Minyard, J.P.; Thompson, A.C.,
Chromatographic and spectral analysis of phenolic acids and related compounds,
J. Chromatogr., 1967, 30, 43-53, https://doi.org/10.1016/S0021-9673(00)84111-4
. [all data]
Wanakhachornkrai and Lertsiri, 9999
Wanakhachornkrai, P.; Lertsiri, S.,
Comparison of determination method for volatile compounds in Thai soy sauce,
Analytical, Nutritional and Clinical Methods, 9999, 1-11. [all data]
Goeminne, Vandendriessche, et al., 2012
Goeminne, P.C.; Vandendriessche, T.; Van Eldere, J.; Nicolai, B.M.; Hertog, M.L.; Dupont, L.J.,
Detection of Pseudomonas aeruginosa in sputum headspace through volatile organic compound analysis,
Respiratory Res., 2012, 13, 87, 1-9. [all data]
Gruzdev, Kuzivanov, et al., 2012
Gruzdev, I.V.; Kuzivanov, I.M.; Zenkevich, I.G.; Kondratenok, B.M.,
Gas-chromatographic identification of products formed in iodination of methyl phenols by retention indices,
Rus. J. Appl. Chem., 2012, 85, 9, 1355-1365, https://doi.org/10.1134/S1070427212090108
. [all data]
Gruzdev, Kuzivanov, et al., 2012, 2
Gruzdev, I.V.; Kuzivanov, I.M.; Zenkevich, I.G.; Kondratenok, B.M.,
Gas chromatographic determination of methylsubstituted phenols in aqueous media with preliminary iodination,
Rus. J. Anal. Chem., 2012, 68, 2, 175-183. [all data]
Kotowska, Zalikowski, et al., 2012
Kotowska, U.; Zalikowski, M.; Isidorov, V.A.,
HS-SPME/GC-MS analysis of volatile and semi-volatile organic compounds emitted from municipal sewage sludge,
Environ. Monit. Asses., 2012, 184, 5, 2893-2907, https://doi.org/10.1007/s10661-011-2158-8
. [all data]
Nawrath, Mgode, et al., 2012
Nawrath, T.; Mgode, G.F.; Weetjens, B.; Kaufmann, S.H.E.; Schulz, S.,
The volatiles of pathogenic and nonpathogenic mycobacteria aand related bacteria,
Beilstein J. Org. Chem., 2012, 8, 290-297, https://doi.org/10.3762/bjoc.8.31
. [all data]
Leffingwell and Alford, 2011
Leffingwell, J.; Alford, E.D.,
Volatile constituents of the giant pufball mushroom (Calvatia gigantea),
Leffingwell Rep., 2011, 4, 1-17. [all data]
Piyachaiseth, Jirapakkul, et al., 2011
Piyachaiseth, T.; Jirapakkul, W.; Chaiseri, S.,
Aroma compounds of flash-fried rice,
Kasetsart J. (Nat. Sci.), 2011, 45, 717-729. [all data]
Majcher, Lawrowski, et al., 2010
Majcher, M.; Lawrowski, P.; Jelen, H.,
Comparison of original and adulterated oscypek cheese based on volatile and sensory profiles,
Acta Sci. Pol. Technol. Aliment., 2010, 9, 3, 265-275. [all data]
Radulovic, Blagojevic, et al., 2010
Radulovic, N.; Blagojevic, P.; Palic, R.,
Comparative study of the leaf volatiles of Arctostaphylos uva-ursi (L.) Spreng. and Vaccinium vitis-idaea L. (Ericaceae),
Molecules, 2010, 15, 9, 6168-6185, https://doi.org/10.3390/molecules15096168
. [all data]
Radulovic, Dordevic, et al., 2010
Radulovic, N.; Dordevic, N.; Markovic, M.; Palic, R.,
Volatile constituents of Glechoma Hirsuta Waldst. Kit. and G. Hederacea L. (Lamiaceae),
Bull. Chem. Soc. Ethiop., 2010, 24, 1, 67-76, https://doi.org/10.4314/bcse.v24i1.52962
. [all data]
Harrison and Priest, 2009
Harrison, B.M.; Priest, F.G.,
Composition of peaks used in the preparation of malt for Scotch Whisky production - influence of geographical source and extraction depth,
J. Agric. Food Chem., 2009, 57, 6, 2385-2391, https://doi.org/10.1021/jf803556y
. [all data]
Pham, Schilling, et al., 2008
Pham, A.J.; Schilling, M.W.; Yoon, Y.; Kamadia, V.V.; Marshall, D.L.,
Characterization of fish sauce aroma-impact compounds using GC-MS, SPME-Osme-GCO, and Stevens' power law exponents,
J. Food. Sci., 2008, 73, 4, c268-c274, https://doi.org/10.1111/j.1750-3841.2008.00709.x
. [all data]
Bozi, Czagany, et al., 2007
Bozi, J.; Czagany, Z.; Meszaros, E.; Blazso, M.,
Thermal decomposition of flame retarded polycarbonates,
J. Anal. Appl. Pyrolysis, 2007, 79, 1-2, 337-345, https://doi.org/10.1016/j.jaap.2007.01.001
. [all data]
Tava, Pecetti, et al., 2007
Tava, A.; Pecetti, L.; Ricci, M.; Pagnotta, M.A.; Russi, L.,
Volatile compounds from leaves and flowers of Bituminaria bituminosa (L.) Stirt. (Fabaceae) from Italy,
Flavour Fragr. J., 2007, 22, 5, 363-370, https://doi.org/10.1002/ffj.1806
. [all data]
Vasta, Ratel, et al., 2007
Vasta, V.; Ratel, J.; Engel, E.,
Mass Spectrometry Analysis of Volatile Compounds in Raw Meat for the Authentication of the Feeding Background of Farm Animals,
J. Agric. Food Chem., 2007, 55, 12, 4630-4639, https://doi.org/10.1021/jf063432n
. [all data]
Xu, Fan, et al., 2007
Xu, Y.; Fan, W.; Qian, M.C.,
Characterization of Aroma Compounds in Apple Cider Using Solvent-Assisted Flavor Evaporation and Headspace Solid-Phase Microextraction,
J. Agric. Food Chem., 2007, 55, 8, 3051-3057, https://doi.org/10.1021/jf0631732
. [all data]
Castel, Fernandez, et al., 2006
Castel, C.; Fernandez, X.; Lizzani-Cuvelier, L.; Loiseau, A.-M.; Perichet, C.; Delbecque, C.; Arnaudo, J.-F.,
Volatile constituents of benzoin gums: Siam and Sumatra, part 2. Study of headspace sampling methods,
Flavour Fragr. J., 2006, 21, 1, 59-67, https://doi.org/10.1002/ffj.1502
. [all data]
Fan and Qian, 2006
Fan, W.; Qian, M.C.,
Identification of aroma compounds in Chinese 'Yanghe Daqu' liquor by normal phase chromatography fractionation followed by gas chromatography/olfactometry,
Flavour Fragr. J., 2006, 21, 2, 333-342, https://doi.org/10.1002/ffj.1621
. [all data]
Lee, Lee, et al., 2005, 2
Lee, K.-G.; Lee, S.-E.; Takeoka, G.R.; Kim, J.-H.; Park, B.-S.,
Antioxidant activity and characterization of volatile constituents of beechwood creosote,
J. Sci. Food Agric., 2005, 85, 9, 1580-1586, https://doi.org/10.1002/jsfa.2156
. [all data]
van Loon, Linssen, et al., 2005
van Loon, W.A.M.; Linssen, J.P.H.; Legger, A.; Posthumus, M.A.; Voragen, A.G.J.,
Identification and olfactometry of French fries flavour extracted at mouth conditions,
Food Chem., 2005, 90, 3, 417-425, https://doi.org/10.1016/j.foodchem.2004.05.005
. [all data]
Park, Lee, et al., 2004
Park, B.-S.; Lee, K.-G.; Takeoka, G.R.,
Comparison of three sample preparation methods on the recovery of volatiles from taheebo (Tabebuia impetiginosa Martius ex DC),
Flavour Fragr. J., 2004, 19, 4, 287-292, https://doi.org/10.1002/ffj.1345
. [all data]
Zenkevich, Moeder, et al., 2004
Zenkevich, I.G.; Moeder, M.; Koeller, G.; Schrader, S.,
Using new structurally related additive schemes in the precalculation of gas chromatographic retention indices of polychlorinated hydroxybiphenyls on HP-5 stationary phase,
J. Chromatogr. A, 2004, 1025, 2, 227-236, https://doi.org/10.1016/j.chroma.2003.10.106
. [all data]
Sebastian, Viallon-Fernandez, et al., 2003
Sebastian, I.; Viallon-Fernandez, C.; Berge, P.; Berdague, J.-L.,
Analysis of the volatile fraction of lamb fat tissue: influence of the type of feeding,
Sciences des Aliments, 2003, 23, 4, 497-511, https://doi.org/10.3166/sda.23.497-511
. [all data]
Wanakhachornkrai and Lertsiri, 2003
Wanakhachornkrai, P.; Lertsiri, S.,
Analytical, nutritional, and clinical methods. Comparison of determination method for volatile compounds in Thai soy sauce,
Food Chem., 2003, 83, 4, 619-629, https://doi.org/10.1016/S0308-8146(03)00256-5
. [all data]
Hayes R.A., Richardson B.J., et al., 2002
Hayes R.A.; Richardson B.J.; Claus S.C.; Wyllie S.G.,
Semiochemicals and social signaling in the wild European rabbit in Australia: II. Variations in chemical composition of chin gland secretion across sampling sites,
J. Chem. Ecol., 2002, 28, 12, 2613-2625, https://doi.org/10.1023/A:1021452623055
. [all data]
Kelling, 2001
Kelling, F.J.,
Olfaction in houseflies: morphology and electrophysiology. Chapter 7. Chemical and electrophysiological analysis of components, present in natural products that attract houseflies, Dissertation, University of Groningen, The Netherlands, 2001. [all data]
Poligné, Collignan, et al., 2001
Poligné, I.; Collignan, A.; Trystram, G.,
Characterization of traditional processing of pork meat into boucané,
Meat Sci., 2001, 59, 4, 377-389, https://doi.org/10.1016/S0309-1740(01)00090-0
. [all data]
Health Safety Executive, 2000
Health Safety Executive,
MDHS 96 Volatile organic compounds in air - Laboratory method using pumed solid sorbent tubes, solvent desorption and gas chromatography
in Methods for the Determination of Hazardous Substances (MDHS) guidance, Crown, Colegate, Norwich, 2000, 1-24, retrieved from http://www.hse.gov.uk/pubns/mdhs/pdfs/mdhs96.pdf. [all data]
Quiroz, Fuentes-Contreras, et al., 1999
Quiroz, A.; Fuentes-Contreras, E.; Ramírez, C.C.; Russell, G.B.; Niemeyer, H.M.,
Host-plant chemicals and distribution of Neuquenaphis ON Nothofagus,
J. Chem. Ecol., 1999, 25, 5, 1043-1054, https://doi.org/10.1023/A:1020825707922
. [all data]
D'Arcy, Rintoul, et al., 1997
D'Arcy, B.R.; Rintoul, G.B.; Rowland, C.Y.; Blackman, A.J.,
Composition of Australian honey extractives. 1. Norisoprenoids, monoterpenes, and other natural volatiles from blue gum (Eucalyptus leucoxylon) and yellow box (Eucalyptus melliodora) honeys,
J. Agric. Food Chem., 1997, 45, 5, 1834-1843, https://doi.org/10.1021/jf960625+
. [all data]
Lu, Yu, et al., 1997
Lu, G.; Yu, T.-H.; Ho, C.-T.,
Generation of flavor compounds by the reaction of 2-deoxyglucose with selected amino acids,
J. Agric. Food Chem., 1997, 45, 1, 233-236, https://doi.org/10.1021/jf960609c
. [all data]
Robacker and Bartelt, 1997
Robacker, D.C.; Bartelt, R.J.,
Chemicals attractive to Mexican fruit fly from Klebsiella pneumoniae and Citrobacter freundii cultures sampled by solid-phase microextraction MICROEXTRACTION,
J. Chem. Ecol., 1997, 23, 12, 2897-2915, https://doi.org/10.1023/A:1022579414233
. [all data]
Yu and Ho, 1995
Yu, T.-H.; Ho, C.-T.,
Volatile compounds generated from thermal reaction of methionine and methionine sulfoxide with or without glucose,
J. Agric. Food Chem., 1995, 43, 6, 1641-1646, https://doi.org/10.1021/jf00054a043
. [all data]
Ciccioli, Cecinato, et al., 1992
Ciccioli, P.; Cecinato, A.; Brancaleoni, E.; Frattoni, M.; Liberti, A.,
Use of carbon adsorption traps combined with high resolution gas chromatography - mass spectrometry for the analysis of polar and non-polar C4-C14 hydrocarbons involved in photochemical smog formation,
J. Hi. Res. Chromatogr., 1992, 15, 2, 75-84, https://doi.org/10.1002/jhrc.1240150205
. [all data]
Binder, Benson, et al., 1990
Binder, R.G.; Benson, M.E.; Flath, R.A.,
Volatile Components of Safflower,
J. Agric. Food Chem., 1990, 38, 5, 1245-1248, https://doi.org/10.1021/jf00095a020
. [all data]
Schwab and Schreier, 1988
Schwab, W.; Schreier, P.,
Simultaneous enzyme catalysis extraction: A versatile technique for the study of flavor precursors,
J. Agric. Food Chem., 1988, 36, 6, 1238-1242, https://doi.org/10.1021/jf00084a028
. [all data]
Harland, Cumming, et al., 1986
Harland, B.J.; Cumming, R.I.; Gillings, E.,
The Kovats indexes of some organic micropollutants on an SE54 capillary column,
EUR, I Org. Micropollut. Aquat. Environ., 1986, EUR 10388, 123-127. [all data]
Habu, Flath, et al., 1985
Habu, T.; Flath, R.A.; Mon, T.R.; Morton, J.F.,
Volatile components of Rooibos tea (Aspalathus linearis),
J. Agric. Food Chem., 1985, 33, 2, 249-254, https://doi.org/10.1021/jf00062a024
. [all data]
Stern, Flath, et al., 1985
Stern, D.J.; Flath, R.A.; Mon, T.R.; Teranishi, R.; Lundin, R.E.; Benson, M.E.,
Crude oleic acid volatiles,
J. Agric. Food Chem., 1985, 33, 2, 180-184, https://doi.org/10.1021/jf00062a005
. [all data]
Spiteller and Spiteller, 1979
Spiteller, M.; Spiteller, G.,
Trennung und charakterisierung saurer harnbest and- teile,
J. Chromatogr., 1979, 164, 3, 253-317, https://doi.org/10.1016/S0378-4347(00)81232-3
. [all data]
Mondello, 2012
Mondello, L.,
HS-SPME-GCxGC-MS analysis of Yerba Mate (Ilex paraguariensis)
in Shimadzu GC-GC application compendium of comprehensive 2D GC, Vol. 1-5, Shimadzu Corp., 2012, 1-29. [all data]
Robinson, Adams, et al., 2012
Robinson, A.L.; Adams, D.O.; Boss, P.K.; Heymann, H.; Solomon, P.S.; Trengove, R.D.,
Influence of geographic origine on the sensory characteristics and wine composition of Vitus viniferas cv. Cabernet Sauvignon wines from Australia (Supplemental data),
Am. J. Enol. Vitic., 2012, 64, 4, 467-476, https://doi.org/10.5344/ajev.2012.12023
. [all data]
Mebazaa, Mahmoudi, et al., 2009
Mebazaa, R.; Mahmoudi, A.; Fouchet, M.; Dos Santos, M.; Kamissoko, F.; Nafti, A.; Ben Cheikh, R.; Rega, B.; Camel, V.,
Characterization of volatile compounds in Tunisian fenugreek seeds,
Food Chem., 2009, 115, 4, 1326-1336, https://doi.org/10.1016/j.foodchem.2009.01.066
. [all data]
de Simon, Estruelas, et al., 2009
de Simon, B.F.; Estruelas, E.; Munoz, A.M.; Cadahia, E.; Sanz, M.,
Volatile compounds in acacia, chestnut, cherry, ash, and oak woods, with a view to their use in cooperage,
J. Agric. Food Chem., 2009, 57, 8, 3217-3227, https://doi.org/10.1021/jf803463h
. [all data]
Staples and Zeiger, 2008
Staples, E.; Zeiger, K.,
On-Site Measurements of VOCs and Odors from Metal Casting Operations Using an Ultra-Fast Gas Chromatograph, 2008, retrieved from http://www.estcal.com/TechPapers/Industrial/FoundryOdors.doc. [all data]
Zhao, Li, et al., 2008
Zhao, Y.; Li, J.; Xu, Y.; Duan, H.; Fan, W.; Zhao, G.,
EXtraction, preparation and identification of volatile compounds in Changyu XO brandy,
Chinese J. Chromatogr., 2008, 26, 2, 212-222, https://doi.org/10.1016/S1872-2059(08)60014-0
. [all data]
Zhu, Li, et al., 2008
Zhu, M.; Li, E.; He, H.,
Determination of volatile chemical constitutes in tea by simultaneous distillation extraction, vacuum hydrodistillation and thermal desrption,
Chromatographia, 2008, 68, 7/8, 603-610, https://doi.org/10.1365/s10337-008-0732-1
. [all data]
Dou, Li, et al., 2007
Dou, H.-L.; Li, C.-M.; Gu, H.-F.; Hao, J.-F.,
Comparative analysis on aromatic components of green tea and fresh green tea beverage using HS-SPME/GC-MS/GC-olfactometry/RI methods,
Journal of Tea Science, 2007, 27, 1, 51-60. [all data]
Ebrahimi and Hadjmohammadi, 2006
Ebrahimi, P.; Hadjmohammadi, M.R.,
Simultaneous modeling of the Kovats retention indices on phenyl OV stationary phases with different polarity using MLR and ANN,
QSAR Comb. Sci., 2006, 25, 10, 836-845, https://doi.org/10.1002/qsar.200530145
. [all data]
Vinogradov, 2004
Vinogradov, B.A.,
Production, composition, properties and application of essential oils, 2004, retrieved from http://viness.narod.ru. [all data]
Begnaud, Pérès, et al., 2003
Begnaud, F.; Pérès, C.; Berdagué, J.-L.,
Characterization of volatile effluents of livestock buildings by solid-phase microextraction,
Int. J. Environ. Anal. Chem., 2003, 83, 10, 837-849, https://doi.org/10.1080/03067310310001603349
. [all data]
Counet, Callemien, et al., 2002
Counet, C.; Callemien, D.; Ouwerx, C.; Collin, S.,
Use of gas chromatography-olfactometry to identify key odorant compounds in dark chocolate. Comparison of samples before and after conching,
J. Agric. Food Chem., 2002, 50, 8, 2385-2391, https://doi.org/10.1021/jf0114177
. [all data]
Fu, Yoon, et al., 2002
Fu, S.-G.; Yoon, Y.; Basemore, R.,
Aroma-actie components in fermented bamboo shoots,
J. Agric. Food Chem., 2002, 50, 3, 549-554, https://doi.org/10.1021/jf010883t
. [all data]
Poligne, Collignan, et al., 2002
Poligne, I.; Collignan, A.; Trystram, G.,
Effects of salting, drying, cooking, and smoking operations on volatile compound formation and collor patterns in pork,
Food Eng. Physical Properties, 2002, 67, 8, 2976-2986. [all data]
Ansorena, Gimeno, et al., 2001
Ansorena, D.; Gimeno, O.; Astiasarán, I.; Bello, J.,
Analysis of volatile compounds by GC-MS of a dry fermented sausage: chorizo de Pamplona,
Food Res. Int., 2001, 34, 1, 67-75, https://doi.org/10.1016/S0963-9969(00)00133-2
. [all data]
Luo and Agnew, 2001
Luo, J.; Agnew, M.P.,
Gas characteristics before and after biofiltration treating odorous emissions from animal rendering processes,
Environ. Technol., 2001, 22, 9, 1091-1103, https://doi.org/10.1080/09593332208618220
. [all data]
Ansorena, Astiasarán, et al., 2000
Ansorena, D.; Astiasarán, I.; Bello, J.,
Influence of the simultaneous addition of the protease flavourzyme and the lipase novozyme 677BG on dry fermented sausage compounds extracted by SDE and analyzed by GC-MS,
J. Agric. Food Chem., 2000, 48, 6, 2395-2400, https://doi.org/10.1021/jf990931y
. [all data]
Guyot, Scheirman, et al., 1999
Guyot, C.; Scheirman, V.; Collin, S.,
Floral origin markers of heather honeys: Calluna vulgaris and Erica arborea,
Food Chem., 1999, 64, 1, 3-11, https://doi.org/10.1016/S0308-8146(98)00122-8
. [all data]
Guyot, Bouseta, et al., 1998
Guyot, C.; Bouseta, A.; Scheirman, V.; Collin, S.,
Floral origin markers of chestnut and lime tree honeys,
J. Agric. Food Chem., 1998, 46, 2, 625-633, https://doi.org/10.1021/jf970510l
. [all data]
Mateo, Aguirrezábal, et al., 1997
Mateo, J.; Aguirrezábal, M.; Domínguez, C.; Zumalacárregui, J.M.,
Volatile compounds in Spanish paprika,
J. Food Comp. Anal., 1997, 10, 3, 225-232, https://doi.org/10.1006/jfca.1997.0535
. [all data]
Mateo and Zumalacárregui, 1996
Mateo, J.; Zumalacárregui, J.M.,
Volatile compounds in chorizo and their changes during ripening,
Meat Sci., 1996, 44, 4, 255-273, https://doi.org/10.1016/S0309-1740(96)00028-9
. [all data]
Peng, 1996
Peng, C.T.,
Gas chromatographic identification of aromatic hydrocarbons
in Liquid Scintillation Spectrometry, Cook, G.T.; Harkness, D.D.; MacKenzie, A.B.; Miller, B.F.; Scott, E.M., ed(s)., 1996, 221-232. [all data]
Buchbauer, Nikiforov, et al., 1994
Buchbauer, G.; Nikiforov, A.; Remberg, B.,
Headspace constituents of opium,
Planta Medica, 1994, 60, 2, 181-183, https://doi.org/10.1055/s-2006-959447
. [all data]
Ciccioli, Cecinato, et al., 1994
Ciccioli, P.; Cecinato, A.; Brancaleoni, E.; Brachetti, A.; Frattoni, M.; Sparapani, R.,
Composition and Distribution of Polar and Non-Polar VOCs in Urban, Rural, Forest and Remote Areas,
Eur Commission EUR, 1994, 549-568. [all data]
Hathcock and Bertsch, 1993
Hathcock, S.; Bertsch, W.,
Analysis of volatiles associated with industrial scale processing of expanded polystyrene. Part II: Identification and quantitation,
J. Hi. Res. Chromatogr., 1993, 16, 11, 651-659, https://doi.org/10.1002/jhrc.1240161106
. [all data]
Um, Bailey, et al., 1992
Um, K.W.; Bailey, M.E.; Clarke, A.D.; Chao, R.R.,
Concentration and identification of volatile compounds from heated beef fat using supercritical CO2 extraction-gas liquid chromatography/mass spectrometry,
J. Agric. Food Chem., 1992, 40, 9, 1641-1646, https://doi.org/10.1021/jf00021a033
. [all data]
Kawai, Ishida, et al., 1991
Kawai, T.; Ishida, Y.; Kakiuchi, H.; Ikeda, N.; Higashida, T.; Nakamura, S.,
Flavor components of dried squid,
J. Agric. Food Chem., 1991, 39, 4, 770-777, https://doi.org/10.1021/jf00004a031
. [all data]
Geldon, 1989
Geldon, A.L.,
Ground Water Hydrology of the Central Raton Basin, Colorado and New Mexico, US Geological Survey, US Government Printing Office, 1989, 104. [all data]
Waggott and Davies, 1984
Waggott, A.; Davies, I.W.,
Identification of organic pollutants using linear temperature programmed retention indices (LTPRIs) - Part II, 1984, retrieved from http://dwi.defra.gov.uk/research/completed-research/reports/dwi0383.pdf. [all data]
Ardrey and Moffat, 1981
Ardrey, R.E.; Moffat, A.C.,
Gas-liquid chromatographic retention indices of 1318 substances of toxicological interest on SE-30 or OV-1 stationary phase,
J. Chromatogr., 1981, 220, 3, 195-252, https://doi.org/10.1016/S0021-9673(00)81925-1
. [all data]
Puvipirom and Chaisei, 2012
Puvipirom, J.; Chaisei, S.,
Contribution of roasted grains and seeds in aroma of oleang (Thai coffee drink),
Int. Food Res. J., 2012, 19, 2, 583-588. [all data]
Kiss, Csoka, et al., 2011
Kiss, M.; Csoka, M.; Gyorfi, J.; Korany, K.,
Comparison of the fragrance constituents of Tuber aestivium and Tuber Brumale gathered in Hungary,
J. Appl. Botany Food Quality, 2011, 84, 102-110. [all data]
Mo, Fan, et al., 2009
Mo, X.; Fan, W.; Xu, Y.,
Changes in volatile compounds of Chinese rice wine wheat qu during fermentation and storage,
J. of the Institute of Brewing, 2009, 115, 4, 300-307, https://doi.org/10.1002/j.2050-0416.2009.tb00385.x
. [all data]
Moon and Shibamoto, 2009
Moon, J.-K.; Shibamoto, T.,
Role of roasting conditions in the profile of volatile flavor chemicals formed from coffee beans,
J. Agric. Food Chem., 2009, 57, 13, 5823-5831, https://doi.org/10.1021/jf901136e
. [all data]
Zhao, Xu, et al., 2009
Zhao, Y.; Xu, Y.; Li, J.; Fan, W.; Jiang, W.,
Profile of volatile compounds in 11 brandies by headspace solid-phase microextraction followed by gas chromatography-mass spectrometry,
J. Food. Sci., 2009, 74, 2, c90-c99, https://doi.org/10.1111/j.1750-3841.2008.01029.x
. [all data]
Kaypak and Avsar, 2008
Kaypak, D.; Avsar, Y.K.,
Volatile and odor-active compounds of tuzlu yoghurt,
Asian J. Chem., 2008, 20, 5, 3641-3648. [all data]
Soria, Sanz, et al., 2008
Soria, A.C.; Sanz, J.; Martinez-Castro, I.,
SPME followed by GC-MS: a powerful technique for qualitative analysis of honey volatiles,
Eur. Food Res. Technol., 2008, 1-12. [all data]
Vichi, Romero, et al., 2008
Vichi, S.; Romero, A.; Tous, J.; Tamames, E.L.; Buxaderas, S.,
Determination of volatile phenols in virgin olive oil and their sensory significatnce,
J. Chromatoghr. A., 2008, 1211, 1-2, 1-7, https://doi.org/10.1016/j.chroma.2008.09.067
. [all data]
Cros, Vandanjon, et al., 2007
Cros, S.; Vandanjon, L.; Jaouen, P.; Bourseau, P.,
Processing of Industrial Mussel Cooking Juices by Reverse Osmotis: Pollution Abatement and Aromas Recovery, 2007, retrieved from title of Internet file: [imstec064]. [all data]
Prososki, Etzel, et al., 2007
Prososki, R.A.; Etzel, M.R.; Rankin, S.A.,
Solvent type affects the number, distribution, and relative quantities of volatile compounds found in sweet whey powder,
J. Dairy Sci., 2007, 90, 2, 523-531, https://doi.org/10.3168/jds.S0022-0302(07)71535-7
. [all data]
Fan and Qian, 2006, 2
Fan, W.; Qian, M.C.,
Characterization of Aroma Compounds of Chinese Wuliangye and Jiannanchun Liquors by Aroma Extract Dilution Analysis,
J. Agric. Food Chem., 2006, 54, 7, 2695-2704, https://doi.org/10.1021/jf052635t
. [all data]
Perestrelo, Fernandes, et al., 2006
Perestrelo, R.; Fernandes, A.; Albuquerque, F.F.; Marques, J.C.; Camara, J.S.,
Analytical characterization of the aroma of Tinta Negra Mole red wine: Identification of the main odorants compounds,
Anal. Chim. Acta., 2006, 563, 1-2, 154-164, https://doi.org/10.1016/j.aca.2005.10.023
. [all data]
Wierda R.L., Fletcher G., et al., 2006
Wierda R.L.; Fletcher G.; Xu L.; Dufour J.P.,
Analysis of volatile compounds as spoilage indicators in fresh king salmon (Oncorhynchus tshawytscha) during storage using SPME-GC-MS,
J. Agric. Food Chem., 2006, 54, 22, 8480-8490, https://doi.org/10.1021/jf061377c
. [all data]
de la Fuente, Martinez-Castro, et al., 2005
de la Fuente, E.; Martinez-Castro, I.; Sanz, J.,
Characterization of Spanish unifloral honeys by solid phase microextraction and gas chromatography-mass spectrometry,
J. Sep. Sci., 2005, 28, 9-10, 1093-1100, https://doi.org/10.1002/jssc.200500018
. [all data]
Kurose and Yatagai, 2005
Kurose, K.; Yatagai, M.,
Components of the essential oils of Azadirachta indica A. Juss, Azadirachta siamensis Velton, and Azadirachta excelsa (Jack) Jacobs and their comparison,
J. Wood Sci., 2005, 51, 2, 185-188, https://doi.org/10.1007/s10086-004-0640-4
. [all data]
Qian and Wang, 2005
Qian, M.C.; Wang, Y.,
Seasonal Variations of Volatile Composition and Odor Activity Value of Marion (Rubus spp. hyb) and Thornless Evergreen (R.laciniatus L.) Blackberries,
J. Food. Sci., 2005, 70, 1, c13-c20, https://doi.org/10.1111/j.1365-2621.2005.tb09013.x
. [all data]
Yao, Guo, et al., 2005
Yao, S.-S.; Guo, W.-F.; Lu, Y.; Jiang, Y.-X.,
Flavor Characteristics of Lapsang Souchong and Smoked Lapsang Souchong, a Special Chinese Black Tea with Pine Smoking Process,
J. Agric. Food Chem., 2005, 53, 22, 8688-8693, https://doi.org/10.1021/jf058059i
. [all data]
López, Ezpeleta, et al., 2004
López, R.; Ezpeleta, E.; Sánchez, I.; Cacho, J.; Ferreira, V.,
Analysis of the aroma intensities of volatile compounds released from mild acid hydrolysates of odourless precursors extracted from Tempranillo and Grenache grapes using gas chromatography-olfactometry,
Food Chem., 2004, 88, 1, 95-103, https://doi.org/10.1016/j.foodchem.2004.01.025
. [all data]
Soria, Gonzalez, et al., 2004
Soria, A.C.; Gonzalez, M.; de Lorenzo, C.; Martinez-Castro, I.; Sanza, J.,
Characterization of artisanal honeys from Madrid (Central Spain) on the basis of their melissopalynological, physicochemical and volatile composition data,
Food Chem., 2004, 85, 1, 121-130, https://doi.org/10.1016/j.foodchem.2003.06.012
. [all data]
Yanagimoto, Ochi, et al., 2004
Yanagimoto, K.; Ochi, H.; Lee, K.-G.; Shibamoto, T.,
Antioxidative activities of fractions obtained from brewed coffee,
J. Agric. Food Chem., 2004, 52, 3, 592-596, https://doi.org/10.1021/jf030317t
. [all data]
Cros, Vandanjon, et al., 2003, 2
Cros, S.; Vandanjon, L.; Jaouen, P.; Bourseau, P.,
IMSTEC'03 Conference Proceedings, Processing of industrial mussel cooking juices by reverse osmosis: pollution abatement and aromas recovery, Universoty of New South Wales, Sydney, Australia, 2003, 6. [all data]
Miyazawa and Okuno, 2003
Miyazawa, M.; Okuno, Y.,
Volatile components from the roots of Scrophularia ningpoensis Hemsl.,
Flavour Fragr. J., 2003, 18, 5, 398-400, https://doi.org/10.1002/ffj.1232
. [all data]
Saura, LAencina, et al., 2003
Saura, D.; LAencina, J.; Perez-Lopez, A.J.; Lizama, V.; Carbonell-Barrachina, A.A.,
Aroma of canned peach halves acidified with clarified lemon juice,
J. Food Sci., 2003, 68, 3, 1080-1085, https://doi.org/10.1111/j.1365-2621.2003.tb08292.x
. [all data]
Tanaka, Yamauchi, et al., 2003
Tanaka, T.; Yamauchi, T.; Katsumata, R.; Kiuchi, K.,
Comparison of volatile components in commercial Itohiki-Natto by solid phase microextraction and gas chromatography,
Nippon Shokuhin Kagaku Kogaku Kaishi, 2003, 50, 6, 278-285, https://doi.org/10.3136/nskkk.50.278
. [all data]
Vichi, Pizzale, et al., 2003
Vichi, S.; Pizzale, L.; Conte, L.S.; Buxaderas, S.; López-Tamames, E.,
Solid-phase microextraction in the analysis of virgin olive oil volatile fraction: characterization of virgin olive oils from two distinct geographical areas of Northern Italy,
J. Agric. Food Chem., 2003, 51, 22, 6572-6577, https://doi.org/10.1021/jf030269c
. [all data]
Lecanu, Ducruet, et al., 2002
Lecanu, L.; Ducruet, V.; Jouquand, C.; Gratadoux, J.J.; Feigenbaum, A.,
Optimization of headspace solid-phase microextraction (SPME) for the odor analysis of surface-ripened cheese,
J. Agric. Food Chem., 2002, 50, 13, 3810-3817, https://doi.org/10.1021/jf0117107
. [all data]
Osorio, Duque, et al., 2002
Osorio, C.; Duque, C.; Suarez, M.; Salamanca, L.E.; Uruena, F.,
Free, glycosidically bound, and phosphate bound flavor constituents of badea (Passiflora quadrangularis) fruit pulp,
J. Sep. Sci., 2002, 25, 3, 147-154, https://doi.org/10.1002/1615-9314(20020201)25:3<147::AID-JSSC147>3.0.CO;2-G
. [all data]
Bendall, 2001
Bendall, J.G.,
Aroma compounds of fresh milk from New Zealand cows fed different diets,
J. Agric. Food Chem., 2001, 49, 10, 4825-4832, https://doi.org/10.1021/jf010334n
. [all data]
Lee and Shibamoto, 2000
Lee, K.-G.; Shibamoto, T.,
Antioxidant properties of aroma compounds isolated from soybeans and mung beans,
J. Agric. Food Chem., 2000, 48, 9, 4290-4293, https://doi.org/10.1021/jf000442u
. [all data]
Paniandy, Chane-Ming, et al., 2000
Paniandy, J.-C.; Chane-Ming, J.; Pierbattesti, J.-C.,
Chemical Composition of the Essential Oil and Headspace Solid-Phase Microextraction of the Guava Fruit (Psidium guajava L.),
J. Essent. Oil Res., 2000, 12, 153-158. [all data]
Parada, Duque, et al., 2000
Parada, F.; Duque, C.; Fujimoto, Y.,
Free and bound volatile composition and characterization of some glucoconjugates as aroma precursors in Melón de olor fruit pulp (Sicana odorifera),
J. Agric. Food Chem., 2000, 48, 12, 6200-6204, https://doi.org/10.1021/jf0007232
. [all data]
Iwatsuki, Mizota, et al., 1999
Iwatsuki, K.; Mizota, Y.; Kubota, T.; Nishimura, O.; Masuda, H.; Sotoyama, K.; Tomita, M.,
Aroma extract dilution analysis. Evluation of aroma of pasteurized and UHT processed milk by aroma extract dilution analysis,
Nippon Shokuhin Kagaku Kogaku Kaishi, 1999, 46, 9, 587-597, https://doi.org/10.3136/nskkk.46.587
. [all data]
Umano, Nakahara, et al., 1999
Umano, K.; Nakahara, K.; Shoji, A.; Shibamoto, T.,
Aroma chemicals isolated and identified from leaves of aloe arborescens Mill. Var. natalensis Berger,
J. Agric. Food Chem., 1999, 47, 9, 3702-3705, https://doi.org/10.1021/jf990116i
. [all data]
Näf and Velluz, 1998
Näf, R.; Velluz, A.,
Phenols and lactones in Italo-Mitcham peppermint oil Mentha × piperita L.,
Flavour Fragr. J., 1998, 13, 3, 203-208, https://doi.org/10.1002/(SICI)1099-1026(199805/06)13:3<203::AID-FFJ725>3.0.CO;2-0
. [all data]
Sekiwa, Kubota, et al., 1997
Sekiwa, Y.; Kubota, K.; Kobayashi, A.,
Characteristic flavor components in the brew of cooked clam (Meretrix lusoria) and the effect of storage on flavor formation,
J. Agric. Food Chem., 1997, 45, 3, 826-830, https://doi.org/10.1021/jf960433e
. [all data]
Kubota, Matsujage, et al., 1996
Kubota, K.; Matsujage, Y.; Sekiwa, Y.; Kobayashi, A.,
Identification of the characteristic volatile flavor compounds formed by cooking squid (Todarodes pacificus Steenstrup),
Food Sci. Technol., 1996, 2, 3, 163-166. [all data]
Shuichi, Masazumi, et al., 1996
Shuichi, H.; Masazumi, N.; Hiromu, K.; Kiyoshi, F.,
Comparison of volatile compounds berween the crude drugs, Onji-tsutsu and Onji-niki,
Nippon nogei kagaku kaishi, 1996, 70, 2, 151-160. [all data]
Kawakami, Ganguly, et al., 1995
Kawakami, M.; Ganguly, S.N.; Banerjee, J.; Kobayashi, A.,
Aroma composition of oolong tea and black tea by brewed extraction method and characterizing compounds of Darjeeling tea aroma,
J. Agric. Food Chem., 1995, 43, 1, 200-207, https://doi.org/10.1021/jf00049a037
. [all data]
Kawakami, Kobayashi, et al., 1993
Kawakami, M.; Kobayashi, A.; Kator, K.,
Volatile constituents of Rooibos tea (Aspalathus linearis) as affected by extraction process,
J. Agric. Food Chem., 1993, 41, 4, 633-636, https://doi.org/10.1021/jf00028a023
. [all data]
Hatsuko, Kazuko, et al., 1992
Hatsuko, S.; Kazuko, H.; Masayoshi, K.; Yoshiaki, I.,
Improvement of quality of likorine extract by heat treatment,
J. Food Sci. Technol., 1992, 39, 11, 976-983, https://doi.org/10.3136/nskkk1962.39.976
. [all data]
Kawakami and Kobayashi, 1991
Kawakami, M.; Kobayashi, A.,
Volatitle constituents of greem mate and roasted mate,
J. Agric. Food Chem., 1991, 39, 7, 1275-1279, https://doi.org/10.1021/jf00007a016
. [all data]
Kubota, Nakamoto, et al., 1991
Kubota, K.; Nakamoto, A.; Moriguchi, M.; Kobayashi, A.; Ishii, H.,
Formation of pyrrolidino[1,2-e]-4H-2,4-dimethyl-1,3,5-dithiazine in the volatiles of boiled short-necked clam, clam, and corbicula,
J. Agric. Food Chem., 1991, 39, 6, 1127-1130, https://doi.org/10.1021/jf00006a027
. [all data]
Hsieh, Williams, et al., 1989
Hsieh, T.C.Y.; Williams, S.S.; Vejaphan, W.; Meyers, S.P.,
Characterization of Volatile Components of Menhaden Fish (Brevoortia tyrannus) Oil,
J. Amer. Oil Chem. Soc., 1989, 66, 1, 114-117, https://doi.org/10.1007/BF02661797
. [all data]
Andersen J.F., Mikolajczak K.L., et al., 1987
Andersen J.F.; Mikolajczak K.L.; Reed D.K.,
Analysis of peach bark volatiles and their electroantennogram activity with lesser pechtree borer, Synanthedon pictipes (Grote and Robinson),
J. Chem. Ecol., 1987, 13, 11, 2103-2114, https://doi.org/10.1007/BF01012874
. [all data]
Welke, Manfroi, et al., 2012
Welke, J.E.; Manfroi, V.; Zanus, M.; Lazarotto, M.; Zini, C.A.,
Characterization of the volatile profile of Brazilian merlot wines through comprehensive two dimensional gas chromatography time-of-flight mass spectrometric detection,
J. Chromatogr. A, 2012, 1226, 124-139, https://doi.org/10.1016/j.chroma.2012.01.002
. [all data]
Xiao, Dai, et al., 2011
Xiao, Z.; Dai, S.; Niu, Y.; Yu, H.; Zhu, J.; Tian, H.; Gu, Y.,
Discrimination of Chinese vinegars based on headspace solid-phase microextraction - gas chromatography mass spectrometry of volatile compounds and multivariate analysis,
J. Food Sci., 2011, 76, 8, c1125-c1135, https://doi.org/10.1111/j.1750-3841.2011.02356.x
. [all data]
Vekiari, Orepoulou, et al., 2010
Vekiari, S.A.; Orepoulou, V.; Kourkoutas, Y.; Kamoun, N.; Msallem, M.; Psimouli, V.; Arapoglou, D.,
Characterization and seasonal variations of the quality of virgin olive oil of the Thoumbolia and Koroneiki varieties from Southern Greece,
Grasas y Aceites, 2010, 61, 3, 221-231, https://doi.org/10.3989/gya.108709
. [all data]
Tao, Wenlai, et al., 2008
Tao, L.; Wenlai, F.; Yan, X.,
Characterization of volatile and semi-volatile compounds in Chinese rica wines by headspace solid phase microextraction followed by gas chromatography - mass spectrometry,
J. Inst. Brew., 2008, 114, 2, 172-179, https://doi.org/10.1002/j.2050-0416.2008.tb00323.x
. [all data]
Zhang, Zhang, et al., 2008
Zhang, C.; Zhang, H.; Wang, L.; Guo, X.,
Effect of carrot (Daucus carota) antifreeze proteins on texture preperties of frozen dough and volatile compounds of crumb,
Food. Sci. Technol. (Lebesmittel-Wissenschaft und Technologie), 2008, 41, 6, 1029-1036, https://doi.org/10.1016/j.lwt.2007.07.010
. [all data]
Gonzalez-Rios, Suarez-Quiroz, et al., 2007
Gonzalez-Rios, O.; Suarez-Quiroz, M.L.; Boulanger, R.; Barel, M.; Guyot, B.; Guiraud, J.-P.; Schorr-Galindo, S.,
Impact of ecological post-harvest processing of coffee aroma: II Roasted coffee.,
J. Food Composition Analysis, 2007, 20, 3-4, 297-307, https://doi.org/10.1016/j.jfca.2006.12.004
. [all data]
Tian, Zhang, et al., 2007
Tian, Y.; Zhang, X.; Huang, T.; Zou, K.; Zhou, J.,
Research advances on the essential oils from leaves of Eucalyptus,
Food Fermentation Ind. (Chinese), 2007, 33, 10, 143-147. [all data]
Vichi, Guadayol, et al., 2007
Vichi, S.; Guadayol, J.M.; Caixach, J.; López-Tamames, E.; Buxaderas, S.,
Analytical, Nutritional, and Clinical Methods. Comparative study of different extraction techniques for the analysis of virgin olive oil aroma,
Food Chem., 2007, 105, 3, 1171-1178, https://doi.org/10.1016/j.foodchem.2007.02.018
. [all data]
Zhang C., Zhang H., et al., 2007
Zhang C.; Zhang H.; Wang L.; Gao H.; Guo X.N.; Yao H.Y.,
Improvement of texture properties and flavor of frozen dough by carrot (Daucus carota) antifreeze protein supplementation,
J. Agric. Food Chem., 2007, 55, 23, 9620-9626, https://doi.org/10.1021/jf0717034
. [all data]
Krings, Zelena, et al., 2006
Krings, U.; Zelena, K.; Wu, S.; Berger, R.G.,
Thin-layer high-vacuum distillation to isolate volatile flavour compounds of cocoa powder,
Eur. Food Res. Technol., 2006, 223, 5, 675-681, https://doi.org/10.1007/s00217-006-0252-x
. [all data]
Piasenzotto, Gracco, et al., 2003
Piasenzotto, L.; Gracco, L.; Conte, L.,
Solid phase microextraction (SPME) applied to honey quality control,
J. Sci. Food Agric., 2003, 83, 10, 1037-1044, https://doi.org/10.1002/jsfa.1502
. [all data]
Mayorga, Knapp, et al., 2001
Mayorga, H.; Knapp, H.; Winterhalter, P.; Duque, C.,
Glycosidically bound flavor compounds of cape gooseberry (Physalis peruviana L.),
J. Agric. Food Chem., 2001, 49, 4, 1904-1908, https://doi.org/10.1021/jf0011743
. [all data]
Caldentey, Daria Fumi, et al., 1998
Caldentey, P.; Daria Fumi, M.; Mazzoleni, V.; Careri, M.,
Volatile compounds produced by microorganisms isolated from cork,
Flavour Fragr. J., 1998, 13, 3, 185-188, https://doi.org/10.1002/(SICI)1099-1026(199805/06)13:3<185::AID-FFJ723>3.0.CO;2-W
. [all data]
Lizárraga-Guerra, Guth, et al., 1997
Lizárraga-Guerra, R.; Guth, H.; López, M.G.,
Identification of the most potent odorants in huitlacoche (Ustilago maydis) and austern pilzen (Pleurotus sp.) by aroma extract dilution analysis and static head-space samples,
J. Agric. Food Chem., 1997, 45, 4, 1329-1332, https://doi.org/10.1021/jf960650f
. [all data]
Peng, Yang, et al., 1991, 2
Peng, C.T.; Yang, Z.C.; Ding, S.F.,
Prediction of rentention idexes. II. Structure-retention index relationship on polar columns,
J. Chromatogr., 1991, 586, 1, 85-112, https://doi.org/10.1016/0021-9673(91)80028-F
. [all data]
Wang, Hou, et al., 2007
Wang, G.; Hou, Z.; Sun, Y.; Liu, Y.; Xie, B.; Liu, S.,
Investigation of pyrolysis behavior of fenoxycarb using PY-GC-MS assisted with chemometric methods,
Chem. Anal., 2007, 52, 141-156. [all data]
Shao, Wang, et al., 2006
Shao, X.; Wang, G.; Sun, Y.; Zhang, R.; Xie, K.; Liu, H.,
Determination and Characterization of the Pyrolysis Products of Isoprocarb by GC-MS,
J. Chromatogr. Sci., 2006, 44, 3, 141-147, https://doi.org/10.1093/chromsci/44.3.141
. [all data]
Williams and Horne, 1995
Williams, P.T.; Horne, P.A.,
Analysis of aromatic hydrocarbons in pyrolytic oil derived from biomass,
J. Anal. Appl. Pyrolysis, 1995, 31, 15-37, https://doi.org/10.1016/0165-2370(94)00814-H
. [all data]
Donnelly, Abdel-Hamid, et al., 1993
Donnelly, J.R.; Abdel-Hamid, M.S.; Jeter, J.L.; Gurka, D.F.,
Application of gas chromatographic retention properties to the identification of environmental contaminants,
J. Chromatogr., 1993, 642, 1-2, 409-415, https://doi.org/10.1016/0021-9673(93)80106-I
. [all data]
Fuentes, Font, et al., 2007
Fuentes, M.J.; Font, R.; Gomez-Rico, M.F.; Martin-Gullon, I.,
Pyrolysis and combustion of waste lubricant oil from diesel cars: Decomposition and pollutants,
J. Anal. Appl. Pyrolysis, 2007, 79, 1-2, 215-226, https://doi.org/10.1016/j.jaap.2006.12.004
. [all data]
Aracil, Font, et al., 2005
Aracil, I.; Font, R.; Conesa, J.A.,
Semivolatile and volatile compounds from the pyrolysis and combustion of polyvinyl chloride,
J. Anal. Appl. Pyrolysis, 2005, 74, 1-2, 465-478, https://doi.org/10.1016/j.jaap.2004.09.008
. [all data]
Eckel, Ross, et al., 1993
Eckel, W.P.; Ross, B.; Isensee, R.K.,
Pentobarbital found in ground water,
Ground Water, 1993, 31, 5, 801-804, https://doi.org/10.1111/j.1745-6584.1993.tb00853.x
. [all data]