Cyclohexanol
- Formula: C6H12O
- Molecular weight: 100.1589
- IUPAC Standard InChIKey: HPXRVTGHNJAIIH-UHFFFAOYSA-N
- CAS Registry Number: 108-93-0
- Chemical structure:
View 3d structure (requires JavaScript / HTML 5) - Other names: Cyclohexyl alcohol; Adronal; Adronol; Anol; Hexahydrophenol; Hexalin; Hydroxycyclohexane; Naxol; Phenol, hexahydro-; 1-Cyclohexanol; Cyclohexane, hydroxy-; Hydralin; Cicloesanolo; Cykloheksanol; Hydrophenol; NSC 403656

Gas phase thermochemistry data

Data compiled as indicated in comments:
ALS - Hussein Y. Afeefy, Joel F. Liebman, and Stephen E. Stein
DRB - Donald R. Burgess, Jr.
GT - Glushko Thermocenter, Russian Academy of Sciences, Moscow
Quantity | Value | Units | Method | Reference | Comment |
---|---|---|---|---|---|
ΔfH°gas | -290. ± 8. | kJ/mol | AVG | N/A | Average of 6 values; Individual data points |
Quantity | Value | Units | Method | Reference | Comment |
S°gas | 353.83 | J/mol*K | N/A | Kabo G.J., 1988 | Other entropy value at 298.15 K obtained from calorimetric data is 327.69 J/mol*K [ Stull D.R., 1969].; GT |
Constant pressure heat capacity of gas
Cp,gas (J/mol*K) | Temperature (K) | Reference | Comment |
---|---|---|---|
132.70 | 298.15 | Kabo G.J., 1988 | Statistically calculated S(T) and Cp(T) values given in [ Thermodynamics Research Center, 1997] are 1-10 and 5-10 J/mol*K, respectively, lower than those of [ Kabo G.J., 1988].; GT |
133.53 | 300. | ||
176.60 | 400. | ||
216.42 | 500. | ||
250.18 | 600. | ||
278.37 | 700. | ||
301.73 | 800. | ||
320.77 | 900. | ||
337.32 | 1000. |

Condensed phase thermochemistry data

Data compiled as indicated in comments:
ALS - Hussein Y. Afeefy, Joel F. Liebman, and Stephen E. Stein
DH - Eugene S. Domalski and Elizabeth D. Hearing
Quantity | Value | Units | Method | Reference | Comment |
---|---|---|---|---|---|
ΔfH°liquid | -352.0 ± 0.67 | kJ/mol | Cac | Wiberg, Wasserman, et al., 1985 | Trifluoroacetolysis; ALS |
ΔfH°liquid | -350. ± 2. | kJ/mol | Ccb | Rabinovoch, Tel'noy, et al., 1962 | ALS |
ΔfH°liquid | -347.4 ± 2.2 | kJ/mol | Ccb | Sellers and Sunner, 1962 | Reanalyzed by Cox and Pilcher, 1970, Original value = -348.2 kJ/mol; ALS |
ΔfH°liquid | -349.2 ± 0.2 | kJ/mol | Ccb | Parks, Mosley, et al., 1950 | ALS |
ΔfH°liquid | -359.2 | kJ/mol | Ccb | Kelley, 1929 | ALS |
Quantity | Value | Units | Method | Reference | Comment |
ΔcH°liquid | -3730. ± 20. | kJ/mol | AVG | N/A | Average of 6 values; Individual data points |
Quantity | Value | Units | Method | Reference | Comment |
S°liquid | 203.87 | J/mol*K | N/A | Adachi, Suga, et al., 1968 | DH |
S°liquid | 199.6 | J/mol*K | N/A | Kelley, 1929 | Average of values derived from measurements on both low and high temperature crystal forms down to 13 K, plus entropy of transition and fusion. Debye extrapolation below 13.5 K.; DH |
Constant pressure heat capacity of liquid
Cp,liquid (J/mol*K) | Temperature (K) | Reference | Comment |
---|---|---|---|
214.06 | 298.15 | Mayer, Rachwalska, et al., 1990 | T = 170 to 320 K. Cp(liq) = -2223.2606 + 22.0059595T - 0.0691686793T2 + 0.0000763592T3 J/mol*K (298 to 320 K). Cp value caluculated from equation.; DH |
209.99 | 298.15 | Caceres-Alonso, Costas, et al., 1988 | DH |
220.1 | 298. | Conti, Gianni, et al., 1976 | DH |
212. | 297.95 | Petit and TerMinassian, 1974 | T = 297 to 428 K. Value is unsmoothed experimental datum.; DH |
213.59 | 300. | Adachi, Suga, et al., 1968 | T = 14 to 320 K.; DH |
202.5 | 305.1 | Phillip, 1939 | DH |
209.03 | 298.15 | Kelley, 1929 | T = 13 to 300 K. Value is unsmoothed experimental datum.; DH |
174.9 | 290. | Herz and Bloch, 1924 | DH |

Phase change data

Data compiled as indicated in comments:
TRC - Thermodynamics Research Center, NIST Boulder Laboratories, Chris Muzny director
BS - Robert L. Brown and Stephen E. Stein
AC - William E. Acree, Jr., James S. Chickos
ALS - Hussein Y. Afeefy, Joel F. Liebman, and Stephen E. Stein
DRB - Donald R. Burgess, Jr.
CAL - James S. Chickos, William E. Acree, Jr., Joel F. Liebman, Students of Chem 202 (Introduction to the Literature of Chemistry), University of Missouri -- St. Louis
DH - Eugene S. Domalski and Elizabeth D. Hearing
Quantity | Value | Units | Method | Reference | Comment |
---|---|---|---|---|---|
Tboil | 433. ± 3. | K | AVG | N/A | Average of 20 out of 21 values; Individual data points |
Quantity | Value | Units | Method | Reference | Comment |
Tfus | 296. ± 5. | K | AVG | N/A | Average of 9 values; Individual data points |
Quantity | Value | Units | Method | Reference | Comment |
Ttriple | 299.09 | K | N/A | Adachi, Suga, et al., 1968, 2 | Crystal phase 1 phase; Uncertainty assigned by TRC = 0.02 K; TRC |
Ttriple | 297.0 | K | N/A | Kelley, 1929, 2 | Crystal phase 1 phase; Uncertainty assigned by TRC = 0.2 K; TRC |
Quantity | Value | Units | Method | Reference | Comment |
Tc | 645. ± 20. | K | AVG | N/A | Average of 6 values; Individual data points |
Quantity | Value | Units | Method | Reference | Comment |
Pc | 40.80 | bar | N/A | Steele, Chirico, et al., 1997 | Uncertainty assigned by TRC = 1.50 bar; derived from fit of obs. vapor pressure; TRC |
Pc | 44.01 | bar | N/A | Wilson, Wilson, et al., 1996 | Uncertainty assigned by TRC = 0.25 bar; TRC |
Pc | 42.6 ± 0.5 | bar | N/A | Gude and Teja, 1995 | |
Pc | 42.60 | bar | N/A | Ambrose and Ghiassee, 1987 | Uncertainty assigned by TRC = 0.50 bar; TRC |
Pc | 37.4902 | bar | N/A | Glaser and Ruland, 1957 | Uncertainty assigned by TRC = 1.5199 bar; TRC |
Quantity | Value | Units | Method | Reference | Comment |
ρc | 3.00 | mol/l | N/A | Steele, Chirico, et al., 1997 | Uncertainty assigned by TRC = 0.10 mol/l; TRC |
Quantity | Value | Units | Method | Reference | Comment |
ΔvapH° | 62. ± 1. | kJ/mol | AVG | N/A | Average of 10 out of 11 values; Individual data points |
Enthalpy of vaporization
ΔvapH (kJ/mol) | Temperature (K) | Method | Reference | Comment |
---|---|---|---|---|
60.1 | 337. | N/A | Steyer and Sundmacher, 2004 | Based on data from 322. to 433. K.; AC |
49.8 | 405. | N/A | Swiatek and Malanowski, 2002 | Based on data from 390. to 430. K.; AC |
61.2 ± 0.6 | 308. | GS | Verevkin, 1998 | Based on data from 288. to 328. K.; AC |
55.0 | 365. | EB | Ambrose and Ghiassee, 1987, 2 | Based on data from 350. to 456. K.; AC |
59.9 | 333. | A | Stephenson and Malanowski, 1987 | Based on data from 318. to 434. K.; AC |
62.7 | 315. | A | Stephenson and Malanowski, 1987 | Based on data from 300. to 434. K.; AC |
49.3 | 418. | N/A | Castellari, Francesconi, et al., 1984 | Based on data from 404. to 432. K.; AC |
58.4 | 318. | N/A | Sipowska and Wieczorek, 1984 | Based on data from 303. to 373. K.; AC |
60.4 | 309. | N/A | Cabani, Conti, et al., 1975 | Based on data from 299. to 319. K.; AC |
52.6 | 382. | N/A | Novák, Matous, et al., 1960 | Based on data from 367. to 433. K. See also Novák, Matous, et al., 1960, 2.; AC |
54.8 | 322. | N/A | Thomson, 1946 | Based on data from 307. to 422. K.; AC |
45.44 | 431.7 | V | Mathews and Fehlandt, 1931 | ALS |
Antoine Equation Parameters
log10(P) = A − (B / (T + C))
P = vapor pressure (bar)
T = temperature (K)
View plot Requires a JavaScript / HTML 5 canvas capable browser.
Temperature (K) | A | B | C | Reference | Comment |
---|---|---|---|---|---|
366.88 to 433.9 | 3.08077 | 777.363 | -182.037 | Novak, Matous, et al., 1960 | Coefficents calculated by NIST from author's data. |
Enthalpy of sublimation
ΔsubH (kJ/mol) | Temperature (K) | Method | Reference | Comment |
---|---|---|---|---|
60.7 | 285. | A | Stephenson and Malanowski, 1987 | Based on data from 272. to 298. K. See also Nitta and Seki, 1948.; AC |
Enthalpy of fusion
ΔfusH (kJ/mol) | Temperature (K) | Method | Reference | Comment |
---|---|---|---|---|
1.73 | 298.2 | DSC | Singh and Murthy, 2009 | AC |
1.7 | 297. | N/A | Pingel, Poser, et al., 1984 | See also Adachi, Suga, et al., 1968 and Domalski and Hearing, 1996.; AC |
Entropy of fusion
ΔfusS (J/mol*K) | Temperature (K) | Reference | Comment |
---|---|---|---|
31.14 | 263.5 | Domalski and Hearing, 1996 | CAL |
5.72 | 297. |
Enthalpy of phase transition
ΔHtrs (kJ/mol) | Temperature (K) | Initial Phase | Final Phase | Reference | Comment |
---|---|---|---|---|---|
0.3784 | 220.9 | crystaline, III | crystaline, II | Mayer, Rachwalska, et al., 1990 | DH |
8.620 | 244.5 | crystaline, III | crystaline, I | Mayer, Rachwalska, et al., 1990 | DH |
8.662 | 264.86 | crystaline, II | crystaline, I | Mayer, Rachwalska, et al., 1990 | DH |
1.806 | 297.92 | crystaline, I | liquid | Mayer, Rachwalska, et al., 1990 | DH |
8.640 | 244.8 | crystaline, III | crystaline, I | Adachi, Suga, et al., 1968 | DH |
8.827 | 265.50 | crystaline, II | crystaline, I | Adachi, Suga, et al., 1968 | DH |
1.783 | 299.09 | crystaline, I | liquid | Adachi, Suga, et al., 1968 | DH |
8.205 | 263.5 | crystaline, II | crystaline, I | Kelley, 1929 | Excess enthalpy over extrapolated heat capacity curves.; DH |
1.699 | 297.0 | crystaline, I | liquid | Kelley, 1929 | Tm is 23.87°C from 16RIC/SHI.; DH |
Entropy of phase transition
ΔStrs (J/mol*K) | Temperature (K) | Initial Phase | Final Phase | Reference | Comment |
---|---|---|---|---|---|
1.713 | 220.9 | crystaline, III | crystaline, II | Mayer, Rachwalska, et al., 1990 | DH |
35.3 | 244.5 | crystaline, III | crystaline, I | Mayer, Rachwalska, et al., 1990 | DH |
32.70 | 264.86 | crystaline, II | crystaline, I | Mayer, Rachwalska, et al., 1990 | DH |
6.06 | 297.92 | crystaline, I | liquid | Mayer, Rachwalska, et al., 1990 | DH |
35.29 | 244.8 | crystaline, III | crystaline, I | Adachi, Suga, et al., 1968 | DH |
33.25 | 265.50 | crystaline, II | crystaline, I | Adachi, Suga, et al., 1968 | DH |
5.96 | 299.09 | crystaline, I | liquid | Adachi, Suga, et al., 1968 | DH |
31.14 | 263.5 | crystaline, II | crystaline, I | Kelley, 1929 | Excess; DH |
5.72 | 297.0 | crystaline, I | liquid | Kelley, 1929 | Tm; DH |

Reaction thermochemistry data

Data compiled by: Hussein Y. Afeefy, Joel F. Liebman, and Stephen E. Stein
Individual Reactions
By formula: C6H10O + H2 = C6H12O
Quantity | Value | Units | Method | Reference | Comment |
---|---|---|---|---|---|
ΔrH° | -75.86 ± 0.50 | kJ/mol | Cm | Wiberg, Crocker, et al., 1991 | liquid phase |
ΔrH° | -63.51 ± 0.63 | kJ/mol | Chyd | Conn, Kistiakowsky, et al., 1939 | gas phase; Reanalyzed by Cox and Pilcher, 1970, Original value = -64.5 ± 0.3 kJ/mol; At 355 K |
By formula: C6H12O + C4F6O3 = C8H11F3O2 + C2HF3O2
Quantity | Value | Units | Method | Reference | Comment |
---|---|---|---|---|---|
ΔrH° | -90.06 ± 0.15 | kJ/mol | Cac | Wiberg, Wasserman, et al., 1985 | liquid phase; Trifluoroacetolysis |
By formula: C6H12O = C6H10O + H2
Quantity | Value | Units | Method | Reference | Comment |
---|---|---|---|---|---|
ΔrH° | 63.4 ± 2.3 | kJ/mol | Eqk | Kabo, Yursha, et al., 1988 | gas phase; Dehydrogenation |
By formula: C6H12O + C3H6O = C6H10O + C3H8O
Quantity | Value | Units | Method | Reference | Comment |
---|---|---|---|---|---|
ΔrH° | 9.9 ± 1.9 | kJ/mol | Eqk | Fedoseenko, Yursha, et al., 1983 | gas phase; At 503 K |
By formula: C6H12O = C6H12 + H2
Quantity | Value | Units | Method | Reference | Comment |
---|---|---|---|---|---|
ΔrH° | 63.4 ± 2.3 | kJ/mol | Eqk | Fedoseenko, Yursha, et al., 1983 | gas phase; At 502 K |
By formula: C6H10O + C5H10O = C6H12O + C5H8O
Quantity | Value | Units | Method | Reference | Comment |
---|---|---|---|---|---|
ΔrH° | -11.6 ± 1.7 | kJ/mol | Eqk | Fedoseenko, Yursha, et al., 1984 | gas phase |
By formula: C6H10O + C3H8O = C6H12O + C3H6O
Quantity | Value | Units | Method | Reference | Comment |
---|---|---|---|---|---|
ΔrH° | -9.9 ± 1.9 | kJ/mol | Eqk | Kabo, Yursha, et al., 1988 | gas phase |

Henry's Law data

Data compiled by: Rolf Sander
Henry's Law constant (water solution)
kH(T) = k°H exp(d(ln(kH))/d(1/T) ((1/T) - 1/(298.15 K)))
k°H = Henry's law constant for solubility in water at 298.15 K (mol/(kg*bar))
d(ln(kH))/d(1/T) = Temperature dependence constant (K)
k°H (mol/(kg*bar)) | d(ln(kH))/d(1/T) (K) | Method | Reference |
---|---|---|---|
170. | V | N/A |

Gas phase ion energetics data

Data compiled as indicated in comments:
LBLHLM - Sharon G. Lias, John E. Bartmess, Joel F. Liebman, John L. Holmes, Rhoda D. Levin, and W. Gary Mallard
LLK - Sharon G. Lias, Rhoda D. Levin, and Sherif A. Kafafi
RDSH - Henry M. Rosenstock, Keith Draxl, Bruce W. Steiner, and John T. Herron
Ionization energy determinations
IE (eV) | Method | Reference | Comment |
---|---|---|---|
9.75 | EI | Rabbih and Selim, 1983 | LBLHLM |
10.0 ± 0.2 | EI | Derrick, Holmes, et al., 1975 | LLK |
10.0 | EI | Ward and Williams, 1969 | RDSH |
Appearance energy determinations
Ion | AE (eV) | Other Products | Method | Reference | Comment |
---|---|---|---|---|---|
C3H5O+ | 11.5 | ? | EI | Ward and Williams, 1969 | RDSH |
C5H7+ | 10.9 | CH3+H2O | EI | Ward and Williams, 1969 | RDSH |
C6H10+ | 10.4 ± 0.05 | H2O | EI | Green, Bafus, et al., 1975 | LLK |
C6H10+ | 10.2 ± 0.2 | H2O | EI | Derrick, Holmes, et al., 1975 | LLK |
C6H10+ | 9.47 | H2O | EI | Lewis and Hamill, 1970 | RDSH |
C6H10+ | 10.4 ± 0.05 | H2O | EI | Green, 1980 | Vertical value; LLK |

Normal alkane RI, non-polar column, isothermal

Data compiled by: NIST Mass Spectrometry Data Center, William E. Wallace, director

Column type CapillaryCapillaryCapillaryCapillaryCapillary
Active phase Polydimethyl siloxanePolydimethyl siloxanePolydimethyl siloxaneMethyl SiliconeMethyl Silicone
Column length (m)
Carrier gas
Substrate
Column diameter (mm)
Phase thickness (μm)
Temperature (C) 105.75.90.100.120.
I 872.866.869.870.875.
ReferenceTello, Lebron-Aguilar, et al., 2009Tello, Lebron-Aguilar, et al., 2009Tello, Lebron-Aguilar, et al., 2009Lebrón-Aguilar, Quintanilla-López, et al., 2007Lebrón-Aguilar, Quintanilla-López, et al., 2007
Comment MSDC-RI MSDC-RI MSDC-RI MSDC-RI MSDC-RI
Column type CapillaryCapillaryCapillary
Active phase Methyl SiliconeMethyl SiliconeDB-1
Column length (m)   60.
Carrier gas   He
Substrate
Column diameter (mm)   0.32
Phase thickness (μm)   1.
Temperature (C) 140.80.60.
I 881.866.861.
ReferenceLebrón-Aguilar, Quintanilla-López, et al., 2007Lebrón-Aguilar, Quintanilla-López, et al., 2007Shimadzu, 2003
Comment MSDC-RI MSDC-RI MSDC-RI

Van Den Dool and Kratz RI, non-polar column, temperature ramp

Data compiled by: NIST Mass Spectrometry Data Center, William E. Wallace, director

Column type CapillaryCapillaryPacked
Active phase HP-5MSCP Sil 5 CBSE-30
Column length (m) 30.50.3.05
Carrier gas HeHeHe
Substrate   Chromosorb AW
Column diameter (mm) 0.250.32
Phase thickness (μm) 0.250.4
Tstart (C) 60.60.40.
Tend (C) 250.280.210.
Heat rate (K/min) 4.3.10.
Initial hold (min) 2.10.10.
Final hold (min) 20.60.30.
I 886.856.885.
ReferencePino, Mesa, et al., 2005Pino and Marbot, 2001Buchman, Cao, et al., 1984
Comment MSDC-RI MSDC-RI MSDC-RI

Van Den Dool and Kratz RI, polar column, custom temperature program

Data compiled by: NIST Mass Spectrometry Data Center, William E. Wallace, director

Column type CapillaryCapillary
Active phase Supelcowax-10Carbowax 20M
Column length (m) 30.150.
Carrier gas He
Substrate
Column diameter (mm) 0.250.75
Phase thickness (μm) 0.25
Program 35C(8min) => 4C/min => 60C => 6C/min => 160C => 20C/min => 200C(1min)not specified
I 1407.1408.
ReferenceBianchi, Careri, et al., 2007Whitfield, Shea, et al., 1981
Comment MSDC-RI MSDC-RI

Kovats' RI, non-polar column, temperature ramp

Data compiled by: NIST Mass Spectrometry Data Center, William E. Wallace, director

Column type CapillaryCapillary
Active phase HP-5MSCBP-1
Column length (m) 30.25.
Carrier gas HeHe
Substrate
Column diameter (mm) 0.250.2
Phase thickness (μm) 0.250.25
Tstart (C) 50.50.
Tend (C) 250.200.
Heat rate (K/min) 3.4.
Initial hold (min) 10.5.
Final hold (min) 5.
I 869.872.
ReferenceAsuming, Beauchamp, et al., 2005Shimadzu, 2003
Comment MSDC-RI MSDC-RI

References

Kabo G.J., 1988
Kabo G.J.,
Thermodynamic properties of cyclohexanol and cyclohexanone,
J. Chem. Thermodyn., 1988, 20, 429-437. [all data]
Stull D.R., 1969
Stull D.R., Jr.,
The Chemical Thermodynamics of Organic Compounds. Wiley, New York, 1969. [all data]
Thermodynamics Research Center, 1997
Thermodynamics Research Center,
Selected Values of Properties of Chemical Compounds., Thermodynamics Research Center, Texas A&M University, College Station, Texas, 1997. [all data]
Wiberg, Wasserman, et al., 1985
Wiberg, K.B.; Wasserman, D.J.; Martin, E.J.; Murcko, M.A.,
Enthalpies of hydration of alkenes. 3. Cycloalkenes,
J. Am. Chem. Soc., 1985, 107, 6019-6022. [all data]
Rabinovoch, Tel'noy, et al., 1962
Rabinovoch, N.B.; Tel'noy, V.I.; Terman, L.M.; Kirillova, A.S.; Razuvaev, G.A.,
The heats of decomposition and formation of dicyclohexyl- and dimethylperoxidecarbonate,
Dokl. Akad. Nauk SSSR, 1962, 143, 133-136. [all data]
Sellers and Sunner, 1962
Sellers, P.; Sunner, S.,
Heats of combustion of cyclic ketones and alcohols,
Acta Chem. Scand., 1962, 16, 46-52. [all data]
Cox and Pilcher, 1970
Cox, J.D.; Pilcher, G.,
Thermochemistry of Organic and Organometallic Compounds, Academic Press, New York, 1970, 1-636. [all data]
Parks, Mosley, et al., 1950
Parks, G.S.; Mosley, J.R.; Peterson, P.V., Jr.,
Heats of combustion and formation of some organic compounds containing oxygen,
J. Chem. Phys., 1950, 18, 152. [all data]
Kelley, 1929
Kelley, K.K.,
Cyclohexanol and the third law of thermodynamics,
J. Am. Chem. Soc., 1929, 51, 1400-1406. [all data]
Adachi, Suga, et al., 1968
Adachi, K.; Suga, H.; Seki, S.,
Phase changes in crystalline and glassy-crystalline cyclohexanol,
Bull. Chem. Soc. Japan, 1968, 41, 1073-1087. [all data]
Mayer, Rachwalska, et al., 1990
Mayer, J.; Rachwalska, M.; Sciesinska, E.; Sciesinski, J.,
On the polymorphism of solid cyclohexanol by adiabatic calorimetry and far infrared methods,
J. Phys.(Paris), 1990, 51(9), 857-867. [all data]
Caceres-Alonso, Costas, et al., 1988
Caceres-Alonso, M.; Costas, M.; Andreoli-Ball, L.; Patterson, D.,
Steric effects on the self-association of branched and cyclic alcohols in inert solvents. Apparent heat capacities of secondary and tertiary alcohols in hydrocarbons,
Can. J. Chem., 1988, 66, 989-998. [all data]
Conti, Gianni, et al., 1976
Conti, G.; Gianni, P.; Matteoli, E.; Mengheri, M.,
Capacita termiche molari di alcuni composti organici mono- e bifunzionali nel liquido puro e in soluzione acquosa a 25C,
Chim. Ind. (Milan), 1976, 58, 225. [all data]
Petit and TerMinassian, 1974
Petit, J.C.; TerMinassian, L.,
Measurements of (dV/dT)p, (dV/dP)T, and (dH/dT)p by flux calorimetry,
J. Chem. Thermodynam., 1974, 6, 1139-1152. [all data]
Phillip, 1939
Phillip, N.M.,
Adiabatic and isothermal compressibilities of liquids,
Proc. Indian Acad. Sci., 1939, A9, 109-120. [all data]
Herz and Bloch, 1924
Herz, W.; Bloch, W.,
Physikalisch-chemische Untersuchungen an Verbindungen der Cyklohexanreihe,
Z. Phys. Chem., 1924, 110, 23-39. [all data]
Adachi, Suga, et al., 1968, 2
Adachi, K.; Suga, H.; Seki, S.,
Phase Changes in Crystalline and Glassy-Crystalline Cyclohexanol,
Bull. Chem. Soc. Japan, 1968, 41, 5, 1073, https://doi.org/10.1246/bcsj.41.1073
. [all data]
Kelley, 1929, 2
Kelley, K.K.,
Cyclohexanol and the third law of thermodynamics,
J. Am. Chem. Soc., 1929, 51, 1400-6. [all data]
Steele, Chirico, et al., 1997
Steele, W.V.; Chirico, R.D.; Knipmeyer, S.E.; Nguyen, A.,
Vapor Pressure, Heat Capacity, and Density along the Saturted Line, Measurements for Cyclohexanol, 2-Cyclohexen-1-one, 1,2-Dichloropropane, 1,4-Di-tert-butylbenzene, (±)-2-Ethylhexanoic Acid, 1-(m,
J. Chem. Eng. Data, 1997, 42, 1021-36. [all data]
Wilson, Wilson, et al., 1996
Wilson, L.C.; Wilson, H.L.; Wilding, W.V.; Wilson, G.M.,
Critical Point Measurements for Fourteen Compounds by a Static Method and a Flow Method,
J. Chem. Eng. Data, 1996, 41, 1252-4. [all data]
Gude and Teja, 1995
Gude, M.; Teja, A.S.,
Vapor-Liquid Critical Properties of Elements and Compounds. 4. Aliphatic Alkanols,
J. Chem. Eng. Data, 1995, 40, 1025-1036. [all data]
Ambrose and Ghiassee, 1987
Ambrose, D.; Ghiassee, N.B.,
Vapor Pressures and Critical Temperatures and Critical Pressures of C5 and C6 Cyclic Alcohols and Ketones,
J. Chem. Thermodyn., 1987, 19, 903. [all data]
Glaser and Ruland, 1957
Glaser, F.; Ruland, H.,
Untersuchungsen über dampfdruckkurven und kritische daten einiger technisch wichtiger organischer substanzen,
Chem. Ing. Techn., 1957, 29, 772. [all data]
Steyer and Sundmacher, 2004
Steyer, Frank; Sundmacher, Kai,
VLE and LLE Data for the System Cyclohexane + Cyclohexene + Water + Cyclohexanol,
J. Chem. Eng. Data, 2004, 49, 6, 1675-1681, https://doi.org/10.1021/je049902w
. [all data]
Swiatek and Malanowski, 2002
Swiatek, Barbara E.; Malanowski, Stanislaw K.,
Vapor-Liquid Equilibrium in m -Xylene + Cyclohexanol at 19.99 and 94.93 kPa,
J. Chem. Eng. Data, 2002, 47, 3, 478-481, https://doi.org/10.1021/je010246z
. [all data]
Verevkin, 1998
Verevkin, Sergey P.,
Thermochemistry of phenols: experimental standard molar enthalpies of formation of 2-phenylphenol, 4-phenylphenol, 2,6-diphenylphenol, and 2,2´- and 4,4´-dihydroxybiphenyl,
The Journal of Chemical Thermodynamics, 1998, 30, 3, 389-396, https://doi.org/10.1006/jcht.1997.0316
. [all data]
Ambrose and Ghiassee, 1987, 2
Ambrose, D.; Ghiassee, N.B.,
Vapour pressures and critical temperatures and critical pressures of C5 and C6 cyclic alcohols and ketones,
The Journal of Chemical Thermodynamics, 1987, 19, 9, 903-909, https://doi.org/10.1016/0021-9614(87)90036-X
. [all data]
Stephenson and Malanowski, 1987
Stephenson, Richard M.; Malanowski, Stanislaw,
Handbook of the Thermodynamics of Organic Compounds, 1987, https://doi.org/10.1007/978-94-009-3173-2
. [all data]
Castellari, Francesconi, et al., 1984
Castellari, Carlo; Francesconi, Romolo; Comelli, Fabio,
Vapor-liquid equilibriums in binary systems containing 1,3-dioxolane at isobaric conditions. 5. Binary mixtures of 1,3-dioxolane with cyclohexanone and cyclohexanol,
J. Chem. Eng. Data, 1984, 29, 1, 90-93, https://doi.org/10.1021/je00035a029
. [all data]
Sipowska and Wieczorek, 1984
Sipowska, Jadwiga T.; Wieczorek, Stefan A.,
Vapour pressures and excess Gibbs free energies of (cyclohexanol + n-heptane) between 303.147 and 373.278 K,
The Journal of Chemical Thermodynamics, 1984, 16, 7, 693-699, https://doi.org/10.1016/0021-9614(84)90051-X
. [all data]
Cabani, Conti, et al., 1975
Cabani, Sergio; Conti, G.; Mollica, V.; Lepori, L.,
Thermodynamic study of dilute aqueous solutions of organic compounds. Part 4.---Cyclic and straight chain secondary alcohols,
J. Chem. Soc., Faraday Trans. 1, 1975, 71, 0, 1943, https://doi.org/10.1039/f19757101943
. [all data]
Novák, Matous, et al., 1960
Novák, J.; Matous, J.; Pick, J.,
Gleichgewicht flüssigkeit-dampf XXIV. Gleichgewicht flüssigkeit-dampf im system cyclohexylamin-cyclohexanol-anilin,
Collect. Czech. Chem. Commun., 1960, 25, 9, 2405-2413, https://doi.org/10.1135/cccc19602405
. [all data]
Novák, Matous, et al., 1960, 2
Novák, J.; Matous, J.; Pick, J.,
Dampfdruck des cyclohexanols und des cyclohexylamins,
Collect. Czech. Chem. Commun., 1960, 25, 2, 583-585, https://doi.org/10.1135/cccc19600583
. [all data]
Thomson, 1946
Thomson, George Wm.,
The Antoine Equation for Vapor-pressure Data.,
Chem. Rev., 1946, 38, 1, 1-39, https://doi.org/10.1021/cr60119a001
. [all data]
Mathews and Fehlandt, 1931
Mathews, J.H.; Fehlandt, P.R.,
The heats of vaporization of some organic compounds,
J. Am. Chem. Soc., 1931, 53, 3212-32. [all data]
Novak, Matous, et al., 1960
Novak, J.; Matous, J.; Pick, J.,
Dampfdruck des Cyclohexanols und des Cyclohexylamins,
Collect. Czech. Chem. Commun., 1960, 25, 2, 583-584, https://doi.org/10.1135/cccc19600583
. [all data]
Nitta and Seki, 1948
Nitta, I.; Seki, S.,
J. Chem. Soc. Jpn. Pure Chem. Sect., 1948, 69, 141. [all data]
Singh and Murthy, 2009
Singh, Lokendra P.; Murthy, S.S.N.,
Dielectric and calorimetric investigation of an unusual two-component plastic crystal: cyclohexanol-neopentylglycol,
Phys. Chem. Chem. Phys., 2009, 11, 25, 5110, https://doi.org/10.1039/b817964f
. [all data]
Pingel, Poser, et al., 1984
Pingel, Norbert; Poser, Uwe; Würflinger, Albert,
Dielectric measurements at high pressures and low temperatures. Part 6.---Dielectric and thermodynamic properties of cyclohexanol,
J. Chem. Soc., Faraday Trans. 1, 1984, 80, 11, 3221, https://doi.org/10.1039/f19848003221
. [all data]
Domalski and Hearing, 1996
Domalski, Eugene S.; Hearing, Elizabeth D.,
Heat Capacities and Entropies of Organic Compounds in the Condensed Phase. Volume III,
J. Phys. Chem. Ref. Data, 1996, 25, 1, 1, https://doi.org/10.1063/1.555985
. [all data]
Wiberg, Crocker, et al., 1991
Wiberg, K.B.; Crocker, L.S.; Morgan, K.M.,
Thermochemical studies of carbonyl compounds. 5. Enthalpies of reduction of carbonyl groups,
J. Am. Chem. Soc., 1991, 113, 3447-3450. [all data]
Conn, Kistiakowsky, et al., 1939
Conn, J.B.; Kistiakowsky, G.B.; Smith, E.A.,
Heats of organic reactions. VIII. Some further hydrogenations, including those of some acetylenes,
J. Am. Chem. Soc., 1939, 61, 1868-1876. [all data]
Kabo, Yursha, et al., 1988
Kabo, G.J.; Yursha, I.A.; Frenkel, M.L.; Poleshchuk, P.A.; Fedoseenko, V.I.; Ladutko, A.I.,
Thermodynamic properties of cyclohexanol and cyclohexanone,
J. Chem. Thermodyn., 1988, 20, 429-437. [all data]
Fedoseenko, Yursha, et al., 1983
Fedoseenko, V.I.; Yursha, I.A.; Kabo, G.Ya.,
Equilibrium and thermodynamics of cyclohexanol dehydrogenation reactions,
Dokl. Akad. Nauk BSSR, 1983, 27, 926-929. [all data]
Fedoseenko, Yursha, et al., 1984
Fedoseenko, V.I.; Yursha, I.A.; Kabo, G.Ya.,
Equilibrium of cyclopentanol dehydrogenation and hydrogen disproportionation in the cyclopentanol-cyclohexanone system,
Dokl. Akad. Nauk BSSR, 1984, 28, 1109-1112. [all data]