Nordazepam
- Formula: C15H11ClN2O
- Molecular weight: 270.714
- IUPAC Standard InChIKey: AKPLHCDWDRPJGD-UHFFFAOYSA-N
- CAS Registry Number: 1088-11-5
- Chemical structure:
View 3d structure (requires JavaScript / HTML 5) - Other names: Nordiazepam; 2H-1,4-Benzodiazepin-2-one, 7-chloro-1,3-dihydro-5-phenyl-; Chlordesmethyldiazepam; Dealkylprazepam; Demethyldiazepam; Desalkylprazepam; Desmethyldiazepam; N-Demethyldiazepam; N-Deoxydemoxepam; N-Desmethyldiazepam; N1-Desmethyldiazepam; Ro 5-2180; A 101; NDZ; 2H-1,4-Benzodiazepin-2-one, 1,3-dihydro-7-chloro-5-phenyl-; 7-Chloro-1,3-dihydro-5-phenyl-2H-1,4-benzodiazepin-2-one; Calmday; 1-Demethyldiazepam; N-Deoxydemoxapam; N-Descyclopropylmethylprazepam; DMDZ; Madar; NDD; Norprazepam; Stilny; Nordaz; Praxadium; NSC 46078; 7-Chloro-5-phenyl-1,3-dihydro-2H-1,4-benzodiazepin-2-one; Demoxepam M (desoxo); Clorazepate, descarboxy; Chlorazepate, descarboxy; Diazepam, N-desmethyl; clorazepic acid, descarboxy

Phase change data

Data compiled by: Eugene S. Domalski and Elizabeth D. Hearing
Enthalpy of phase transition
ΔHtrs (kcal/mol) | Temperature (K) | Initial Phase | Final Phase | Reference | Comment |
---|---|---|---|---|---|
8.0354 | 214.2 | crystaline, IV | liquid | Chauvet and El Moussaoui, 1992 | |
6.5488 | 216.0 | crystaline, III | liquid | Chauvet and El Moussaoui, 1992 | |
8.1262 | 216.7 | crystaline, II | liquid | Chauvet and El Moussaoui, 1992 | |
5.8437 | 221.3 | crystaline, I | liquid | Chauvet and El Moussaoui, 1992 |

Kovats' RI, non-polar column, isothermal

Data compiled by: NIST Mass Spectrometry Data Center, William E. Wallace, director

Column type CapillaryCapillaryCapillaryCapillaryCapillary
Active phase SE-30DB-1BP-1DB-1BP-1
Column length (m)  30.25.30.25.
Carrier gas  N2N2N2N2
Substrate
Column diameter (mm)  0.530.220.530.22
Phase thickness (μm)  1.50.251.50.25
Temperature (C) 250.250.250.250.250.
I 2493.2493.2522.2493.2521.
ReferenceDimov and Moskovkina, 1991Japp, Garthwaite, et al., 1988Japp, Garthwaite, et al., 1988Japp, Garthwaite, et al., 1988Japp, Garthwaite, et al., 1988
Comment MSDC-RI MSDC-RI MSDC-RI MSDC-RI MSDC-RI
Column type PackedPackedCapillaryPackedPacked
Active phase SE-30SE-30SPB-1SE-30SE-30
Column length (m) 2.2.25. 1.5
Carrier gas N2N2HeN2N2
Substrate 1% se-30 on Anachrom ABS(80-100mesh)1% se-30 on Anachrom ABS(80-100mesh)  Chromosorb G AW DMCS (80-100 mesh)
Column diameter (mm)   0.20
Phase thickness (μm)
Temperature (C) 240.240.250.250.250.
I 2489.2480.2517.2554.2555.
ReferenceMusumarra, Scarlata, et al., 1987Musumarra, Scarlata, et al., 1987Lora-Tamayo, Rams, et al., 1986Schütz, 1982Schuetz and Westenberger, 1979
Comment MSDC-RI MSDC-RI MSDC-RI MSDC-RI MSDC-RI

References

Chauvet and El Moussaoui, 1992
Chauvet, A.; El Moussaoui, A.,
and Masse J., Thermoanalytical and spectral studies of the benzodiazepines. 2. Nordazepam,
Thermochim. Acta, 1992, 210, 133-145. [all data]