Cyanuric acid
- Formula: C3H3N3O3
- Molecular weight: 129.0742
- IUPAC Standard InChIKey: ZFSLODLOARCGLH-UHFFFAOYSA-N
- CAS Registry Number: 108-80-5
- Chemical structure:
View 3d structure (requires JavaScript / HTML 5) - Species with the same structure:
- Other names: 1,3,5-Triazine-2,4,6(1H,3H,5H)-trione; s-Triazine-2,4,6(1H,3H,5H)-trione; s-Triazine-2,4,6-triol; s-Triazinetriol; Isocyanuric acid; Pseudocyanuric acid; Tricyanic acid; Trihydroxycyanidine; 2,4,6-Trihydroxy-1,3,5-triazine; 1,3,5-Triazine-2,4,6-triol; s-2,4,6-Triazinetriol; sym-Triazinetriol; Kyselina kyanurova; 2,4,6-Trihydroxytriazine; 2,4,6-Trihydroxy-S-triazine; 2,4,6-Trioxohexahydro-1,3,5-triazine; 5-Azabarbituric acid; 2,4,6-Triazinetrione; Isocyanurate acid; s-Triazine-2,4,6-trione; s-Triazinetrione; Tricarbimide; NSC 6284

Gas phase thermochemistry data

Data compiled by: Hussein Y. Afeefy, Joel F. Liebman, and Stephen E. Stein
Quantity | Value | Units | Method | Reference | Comment |
---|---|---|---|---|---|
ΔfH°gas | -564.1 ± 1.5 | kJ/mol | Ccb | Kozyro, Kabo, et al., 1992 |

Condensed phase thermochemistry data

Data compiled as indicated in comments:
ALS - Hussein Y. Afeefy, Joel F. Liebman, and Stephen E. Stein
DH - Eugene S. Domalski and Elizabeth D. Hearing
Quantity | Value | Units | Method | Reference | Comment |
---|---|---|---|---|---|
ΔfH°solid | -703.5 ± 1.5 | kJ/mol | Ccb | Kozyro, Kabo, et al., 1992 | ALS |
ΔfH°solid | -660. ± 2. | kJ/mol | Ccb | Selivanov, Karlik, et al., 1973 | ALS |
Quantity | Value | Units | Method | Reference | Comment |
ΔcH°solid | -905.8 ± 1.5 | kJ/mol | Ccb | Kozyro, Kabo, et al., 1992 | ALS |
ΔcH°solid | -949. ± 2. | kJ/mol | Ccb | Selivanov, Karlik, et al., 1973 | ALS |
Quantity | Value | Units | Method | Reference | Comment |
S°solid,1 bar | 142.2 | J/mol*K | N/A | Kozyro, Kabo, et al., 1992, 2 | DH |
Constant pressure heat capacity of solid
Cp,solid (J/mol*K) | Temperature (K) | Reference | Comment |
---|---|---|---|
130.0 | 298.15 | Kozyro, Kabo, et al., 1992, 2 | T = 5 to 330 K.; DH |
133.63 | 300. | DeWit, DeKruif, et al., 1983 | T = 90 to 340 K. Cp = 20.63 + 0.3758 (T/K) J/mol*K (90 to 340 K).; DH |

Phase change data

Data compiled as indicated in comments:
AC - William E. Acree, Jr., James S. Chickos
ALS - Hussein Y. Afeefy, Joel F. Liebman, and Stephen E. Stein
Quantity | Value | Units | Method | Reference | Comment |
---|---|---|---|---|---|
ΔsubH° | 133. | kJ/mol | N/A | De Wit, Van Miltenburg, et al., 1983 | AC |
Enthalpy of sublimation
ΔsubH (kJ/mol) | Temperature (K) | Method | Reference | Comment |
---|---|---|---|---|
139.5 | 470. | V | Kozyro, Kabo, et al., 1992 | ALS |
131. | 458. | ME,TE | De Wit, Van Miltenburg, et al., 1983 | Based on data from 440. to 473. K.; AC |

References

Kozyro, Kabo, et al., 1992
Kozyro, A.A.; Kabo, G.Ya.; Soldatova, T.V.; Simirskii, V.V.; Gogolinskii, V.I.; Krasulin, A.P.; Dudarevich, N.M.,
Thermodynamic properties of cyanuric acid,
Russ. J. Phys. Chem. (Engl. Transl.), 1992, 66, 1374-1377. [all data]
Selivanov, Karlik, et al., 1973
Selivanov, V.D.; Karlik, V.M.; Zagranicnyi, V.I.,
Standard enthalpies of formation ammeline, ammelide, melem, and melon,
Russ. J. Phys. Chem. (Engl. Transl.), 1973, 47, 272. [all data]
Kozyro, Kabo, et al., 1992, 2
Kozyro, A.A.; Kabo, G.Ya.; Soldatova, T.V.; Simirskii, V.V.; Gogolinskii, V.I.; Krasulin, A.P.; Dudarevich, N.M.,
Thermodynamic properties of cyanuric acid,
Zhur. Fiz. Khim., 1992, 66(10), 2583-2590. [all data]
DeWit, DeKruif, et al., 1983
DeWit, H.G.M.; DeKruif, C.G.; Van Miltenburg, J.C.,
Thermodynamic properties of molecular organic crystals containing organic crystals containing nitrogen, oxygen, and sulfur. II. Molar heat capacities of eight compounds by adiabatic calorimetry,
J. Chem. Thermodynam., 1983, 15, 891-902. [all data]
De Wit, Van Miltenburg, et al., 1983
De Wit, H.G.M.; Van Miltenburg, J.C.; De Kruif, C.G.,
Thermodynamic properties of molecular organic crystals containing nitrogen, oxygen, and sulphur 1. Vapour pressures and enthalpies of sublimation,
The Journal of Chemical Thermodynamics, 1983, 15, 7, 651-663, https://doi.org/10.1016/0021-9614(83)90079-4
. [all data]