4,6-Dimethyl-2-pyrimidone
- Formula: C6H8N2O
- Molecular weight: 124.1405
- IUPAC Standard InChIKey: WHEQVHAIRSPYDK-UHFFFAOYSA-N
- CAS Registry Number: 108-79-2
- Chemical structure:
View 3d structure (requires JavaScript / HTML 5) - Other names: 4,6-Dimethyl-2-hydroxypyrimidine; 2(1H)-Pyrimidinone, 4,6-dimethyl-; 4,6-Dimethyl-2-pyrimidinol; 4,6-dimethylpyrimidin-2-ol

Reaction thermochemistry data

Data compiled by: Hussein Y. Afeefy, Joel F. Liebman, and Stephen E. Stein
Individual Reactions
=
By formula: C6H8N2O = C6H8N2O
Quantity | Value | Units | Method | Reference | Comment |
---|---|---|---|---|---|
ΔrH° | -8. | kJ/mol | Eqk | Nowak, Szczepaniak, et al., 1980 | gas phase |

References

Nowak, Szczepaniak, et al., 1980
Nowak, M.J.; Szczepaniak, K.; Barski, A.; Shugar, D.,
Tautomeric equilibria of 2(4)-monooxopyrimidines in the gas phase, in low-temperature matrices and in solution,
J. Mol. Struct., 1980, 62, 47-69. [all data]