1,3,5-Triazine, 2,4,6-trichloro-
- Formula: C3Cl3N3
- Molecular weight: 184.411
- IUPAC Standard InChIKey: MGNCLNQXLYJVJD-UHFFFAOYSA-N
- CAS Registry Number: 108-77-0
- Chemical structure:
View 3d structure (requires JavaScript / HTML 5) - Other names: s-Triazine, 2,4,6-trichloro-; s-Triazine trichloride; s-Trichlorotriazine; Cyanuric chloride; Cyanur chloride; Cyanuric trichloride; Cyanuryl chloride; Trichloro-s-triazine; Trichlorocyanidine; 1,3,5-Trichlorotriazine; 2,4,6-Trichloro-s-triazine; 2,4,6-Trichloro-1,3,5-triazine; 2,4,6-Trichlorotriazine; 2,4,6-Trichloro-sym-triazine; syn-Trichlotriazin; Chlorotriazine; Cyanuric acid chloride; Kyanurchlorid; Tricyanogen chloride; sym-Trichlorotriazine; UN 2670; 1,3,5-Trichloro-2,4,6-triazine; 2,4,6-Trichlor-(1,3,5)triazine; NSC 3512

Condensed phase thermochemistry data

Data compiled by: Hussein Y. Afeefy, Joel F. Liebman, and Stephen E. Stein
Quantity | Value | Units | Method | Reference | Comment |
---|---|---|---|---|---|
ΔfH°solid | 94.3 ± 2.5 | kJ/mol | Ccr | Lyubarskii, Smolyanets, et al., 1984 | |
ΔfH°solid | 91.6 | kJ/mol | Cm | Humphries and Nicholson, 1957 | |
Quantity | Value | Units | Method | Reference | Comment |
ΔcH°solid | -1345.9 ± 2.1 | kJ/mol | Ccr | Lyubarskii, Smolyanets, et al., 1984 |

Phase change data

Data compiled as indicated in comments:
BS - Robert L. Brown and Stephen E. Stein
TRC - Thermodynamics Research Center, NIST Boulder Laboratories, Chris Muzny director
Quantity | Value | Units | Method | Reference | Comment |
---|---|---|---|---|---|
Tboil | 463.2 | K | N/A | Aldrich Chemical Company Inc., 1990 | BS |
Quantity | Value | Units | Method | Reference | Comment |
Tfus | 418.87 | K | N/A | Witschonke, 1954 | Uncertainty assigned by TRC = 0.1 K; TRC |
Tfus | 418.9 | K | N/A | Witschonke, 1954 | Uncertainty assigned by TRC = 0.06 K; TRC |
Reduced pressure boiling point
Tboil (K) | Pressure (bar) | Reference | Comment |
---|---|---|---|
463.2 | 0.960 | Weast and Grasselli, 1989 | BS |

Reaction thermochemistry data

Data compiled by: Hussein Y. Afeefy, Joel F. Liebman, and Stephen E. Stein
Individual Reactions
By formula: C3Cl3N3 + 3H2O = C3H3N3O3 + 3HCl
Quantity | Value | Units | Method | Reference | Comment |
---|---|---|---|---|---|
ΔrH° | -399.1 ± 0.2 | kJ/mol | Cm | Humphries and Nicholson, 1957 | solid phase |

Normal alkane RI, non-polar column, custom temperature program

Column type | Active phase | I | Reference | Comment |
---|---|---|---|---|
Capillary | OV-1 | 1051. | Waggott and Davies, 1984 | Hydrogen; Column length: 50. m; Column diameter: 0.32 mm; Program: not specified |

References

Lyubarskii, Smolyanets, et al., 1984
Lyubarskii, M.V.; Smolyanets, R.I.; Gromova, T.I.; Sukhanova, T.G.,
Heats of combustion and of formation of cyanuric chloride,
Russ. J. Phys. Chem. (Engl. Transl.), 1984, 58, 458-459. [all data]
Humphries and Nicholson, 1957
Humphries, A.R.; Nicholson, G.R.,
472. The heat of formation of cyanuric chloride and the heat of trimerisation of cyanogen chloride,
J. Chem. Phys., 1957, 2429-2431. [all data]
Aldrich Chemical Company Inc., 1990
Aldrich Chemical Company Inc.,
Catalog Handbook of Fine Chemicals, Aldrich Chemical Company, Inc., Milwaukee WI, 1990, 1. [all data]
Witschonke, 1954
Witschonke, C.R.,
Freezing point and purity data for some organic compounds,
Anal. Chem., 1954, 26, 562-4. [all data]
Weast and Grasselli, 1989
CRC Handbook of Data on Organic Compounds, 2nd Editon, Weast,R.C and Grasselli, J.G., ed(s)., CRC Press, Inc., Boca Raton, FL, 1989, 1. [all data]
Klotz and Askounts, 1947
Klotz, I.M.; Askounts, T.,
J. Am. Chem. Soc., 1947, 69, 801. [all data]
Waggott and Davies, 1984
Waggott, A.; Davies, I.W.,
Identification of organic pollutants using linear temperature programmed retention indices (LTPRIs) - Part II, 1984, retrieved from http://dwi.defra.gov.uk/research/completed-research/reports/dwi0383.pdf. [all data]