Benzene, 1,1'-(1,6-hexanediyl)bis-
- Formula: C18H22
- Molecular weight: 238.3673
- IUPAC Standard InChIKey: DVGPMIRVCZNXMD-UHFFFAOYSA-N
- CAS Registry Number: 1087-49-6
- Chemical structure:
View 3d structure (requires JavaScript / HTML 5) - Other names: Hexane, 1,6-diphenyl-; 1,6-Diphenylhexane

Condensed phase thermochemistry data

Data compiled by: Hussein Y. Afeefy, Joel F. Liebman, and Stephen E. Stein
Quantity | Value | Units | Method | Reference | Comment |
---|---|---|---|---|---|
ΔcH°liquid | -10230. | kJ/mol | Ccb | Serijan and Wise, 1951 | Corresponding ΔfHºliquid = 8. kJ/mol (simple calculation by NIST; no Washburn corrections) |

Phase change data

Data compiled as indicated in comments:
TRC - Thermodynamics Research Center, NIST Boulder Laboratories, Chris Muzny director
AC - William E. Acree, Jr., James S. Chickos
Quantity | Value | Units | Method | Reference | Comment |
---|---|---|---|---|---|
Tboil | 618.82 | K | N/A | Serijan and Wise, 1951, 2 | Uncertainty assigned by TRC = 0.2 K; TRC |
Quantity | Value | Units | Method | Reference | Comment |
Tfus | 261.16 | K | N/A | Serijan and Wise, 1951, 2 | Uncertainty assigned by TRC = 0.05 K; TRC |
Tfus | 280.1 | K | N/A | Boelhouwer, Nederbragt, et al., 1950 | Uncertainty assigned by TRC = 2. K; TRC |
Enthalpy of vaporization
ΔvapH (kJ/mol) | Temperature (K) | Method | Reference | Comment |
---|---|---|---|---|
88.0 | 308. | A | Stephenson and Malanowski, 1987 | Based on data from 293. to 373. K. See also Morecroft, 1964.; AC |
Antoine Equation Parameters
log10(P) = A − (B / (T + C))
P = vapor pressure (bar)
T = temperature (K)
View plot Requires a JavaScript / HTML 5 canvas capable browser.
Temperature (K) | A | B | C | Reference | Comment |
---|---|---|---|---|---|
293. to 373. | 8.50139 | 4715.873 | 4.488 | Morecroft, 1964 | Coefficents calculated by NIST from author's data. |

Gas phase ion energetics data

Data evaluated by: Edward P. Hunter and Sharon G. Lias
Quantity | Value | Units | Method | Reference | Comment |
---|---|---|---|---|---|
Proton affinity (review) | 826.1 | kJ/mol | N/A | Hunter and Lias, 1998 | |
Quantity | Value | Units | Method | Reference | Comment |
Gas basicity | 783.8 | kJ/mol | N/A | Hunter and Lias, 1998 |

References

Serijan and Wise, 1951
Serijan, K.T.; Wise, P.H.,
Dicyclic hydrocarbons. IV. Synthesis and physical properties of α,α- and α,omega-diphenyl- and dicyclohexyl- pentanes and hexanes,
J. Am. Chem. Soc., 1951, 73, 5191-5193. [all data]
Serijan and Wise, 1951, 2
Serijan, K.T.; Wise, P.H.,
Dicyclic hydrocarboms. IV. Synthesis and Physical properties of alpha,alpha - and alpha,omega-diphenyl- and dicyclohexyl- pentanes and hexanes,
J. Am. Chem. Soc., 1951, 73, 5191. [all data]
Boelhouwer, Nederbragt, et al., 1950
Boelhouwer, J.W.M.; Nederbragt, G.W.; Verberg, G.W.,
Viscosity data of organic liquids,
Appl. Sci. Res., Sect. A, 1950, 2, 249. [all data]
Stephenson and Malanowski, 1987
Stephenson, Richard M.; Malanowski, Stanislaw,
Handbook of the Thermodynamics of Organic Compounds, 1987, https://doi.org/10.1007/978-94-009-3173-2
. [all data]
Morecroft, 1964
Morecroft, D.W.,
Vapor Pressures of Some High Molecular Weight Hydrocarbons.,
J. Chem. Eng. Data, 1964, 9, 4, 488-490, https://doi.org/10.1021/je60023a003
. [all data]
Hunter and Lias, 1998
Hunter, E.P.; Lias, S.G.,
Evaluated Gas Phase Basicities and Proton Affinities of Molecules: An Update,
J. Phys. Chem. Ref. Data, 1998, 27, 3, 413-656, https://doi.org/10.1063/1.556018
. [all data]