1,3,5-Benzenetriol
- Formula: C6H6O3
- Molecular weight: 126.1100
- IUPAC Standard InChIKey: QCDYQQDYXPDABM-UHFFFAOYSA-N
- CAS Registry Number: 108-73-6
- Chemical structure:
View 3d structure (requires JavaScript / HTML 5) - Other names: Phloroglucinol; s-Trihydroxybenzene; Benzene-s-triol; Phloroglucin; Phloroglucine; 1,3,5-Trihydroxybenzene; sym-Trihydroxybenzene; Benzene, trihydroxy; Benzene, 1,3,5-trihydroxy-; Spasfon-Lyoc; 1,3,5-Trihydroxycyclohexatriene; 3,5-Dihydroxyphenol; 5-Hydroxyresorcinol; 5-Oxyresorcinolphloroglucin; Benzene-1,3,5-triol; Dilospan S; Floroglucin; Floroglucinol; 5-Oxyresorcinol; 1,3,5-THB; NSC 1572; Phloroglucinol (1,3,5-benzenetriol)

Gas phase thermochemistry data

Data compiled by: Hussein Y. Afeefy, Joel F. Liebman, and Stephen E. Stein
Quantity | Value | Units | Method | Reference | Comment |
---|---|---|---|---|---|
ΔfH°gas | -452.9 ± 1.5 | kJ/mol | Ccb | Ribeiro Da Silva, Ribeiro Da Silva, et al., 1986 |

Condensed phase thermochemistry data

Data compiled by: Hussein Y. Afeefy, Joel F. Liebman, and Stephen E. Stein
Quantity | Value | Units | Method | Reference | Comment |
---|---|---|---|---|---|
ΔfH°solid | -584.6 ± 1.1 | kJ/mol | Ccb | Ribeiro Da Silva, Ribeiro Da Silva, et al., 1986 | |
Quantity | Value | Units | Method | Reference | Comment |
ΔcH°solid | -2634.0 ± 0.7 | kJ/mol | Ccb | Ribeiro Da Silva, Ribeiro Da Silva, et al., 1986 | Corresponding ΔfHºsolid = -584.6 kJ/mol (simple calculation by NIST; no Washburn corrections) |

Phase change data

Data compiled as indicated in comments:
AC - William E. Acree, Jr., James S. Chickos
ALS - Hussein Y. Afeefy, Joel F. Liebman, and Stephen E. Stein
DRB - Donald R. Burgess, Jr.
Quantity | Value | Units | Method | Reference | Comment |
---|---|---|---|---|---|
ΔsubH° | 135.5 ± 1.3 | kJ/mol | GS | Verevkin and Schick, 2004 | Based on data from 355. to 382. K.; AC |
ΔsubH° | 131.7 ± 1.0 | kJ/mol | C | Ribeiro Da Silva, Ribeiro Da Silva, et al., 1986 | ALS |
ΔsubH° | 131.7 | kJ/mol | N/A | Ribeiro Da Silva, Ribeiro Da Silva, et al., 1986 | DRB |
ΔsubH° | 131.7 ± 1.0 | kJ/mol | C | Ribeiro Da Silva, Ribeiro Da Silva, et al., 1986 | AC |
Enthalpy of sublimation
ΔsubH (kJ/mol) | Temperature (K) | Method | Reference | Comment |
---|---|---|---|---|
127.9 | 383. to 406. | TE,ME | de Wit, 1983 | AC |
Enthalpy of fusion
ΔfusH (kJ/mol) | Temperature (K) | Reference | Comment |
---|---|---|---|
34.5 | 491.8 | Verevkin and Schick, 2004 | AC |

Van Den Dool and Kratz RI, non-polar column, custom temperature program

Column type | Active phase | I | Reference | Comment |
---|---|---|---|---|
Capillary | VF-5MS | 1609.6 | Tret'yakov, 2008 | 30. m/0.25 mm/0.25 μm, He; Program: Multi-step temperature program; T(initial)=60C; T(final)=270C |

References

Ribeiro Da Silva, Ribeiro Da Silva, et al., 1986
Ribeiro Da Silva, M.D.M.C.; Ribeiro Da Silva, M.A.V.; Pilcher, G.,
Enthalpies of combustion of the three trihydroxybenzenes and of 3-methoxycatechol and 4-nitrocatechol,
J. Chem. Thermodyn., 1986, 18, 295-300. [all data]
Verevkin and Schick, 2004
Verevkin, Sergey P.; Schick, Christoph,
Determination of vapor pressures, enthalpies of sublimation, and enthalpies of fusion of benzenetriols,
Thermochimica Acta, 2004, 415, 1-2, 35-42, https://doi.org/10.1016/j.tca.2003.09.011
. [all data]
de Wit, 1983
de Wit, H.G.M.,
Vapor pressures and lattice energies of oxalic acid, mesotartaric acid, phloroglucinol, myoinositol, and their hydrates,
J. Chem. Phys., 1983, 78, 3, 1470, https://doi.org/10.1063/1.444836
. [all data]
Tret'yakov, 2008
Tret'yakov, K.V.,
Retention Data. NIST Mass Spectrometry Data Center., NIST Mass Spectrometry Data Center, 2008. [all data]