CAS Reg. No. 108658-52-2
- CAS Registry Number: 108658-52-2

Reaction thermochemistry data

Data compiled by: John E. Bartmess
Individual Reactions
(CAS Reg. No. 108658-52-2 • 4294967295) +
= CAS Reg. No. 108658-52-2
By formula: (CAS Reg. No. 108658-52-2 • 4294967295Cu) + Cu = CAS Reg. No. 108658-52-2
Quantity | Value | Units | Method | Reference | Comment |
---|---|---|---|---|---|
ΔrH° | 227. ± 12. | kJ/mol | N/A | Spasov, Lee, et al., 2000 | gas phase; 0 K dissociation energy |

References

Spasov, Lee, et al., 2000
Spasov, V.A.; Lee, T.H.; Ervin, K.M.,
Threshold collision-induced dissociation of anionic copper clusters and copper cluster monocarbonyls,
J. Chem. Phys., 2000, 112, 4, 1713-1720, https://doi.org/10.1063/1.480736
. [all data]