1-Methoxy-2-propyl acetate
- Formula: C6H12O3
- Molecular weight: 132.1577
- IUPAC Standard InChIKey: LLHKCFNBLRBOGN-UHFFFAOYSA-N
- CAS Registry Number: 108-65-6
- Chemical structure:
View 3d structure (requires JavaScript / HTML 5) - Other names: Propylene glycol 1-methyl ether 2-acetate; 2-Propanol, 1-methoxy-, acetate; Acetic acid, 2-methoxy-1-methylethyl ester; 2-Acetoxy-1-methoxypropane; Propyleneglycol monomethyl ether acetate; 1-Methoxy-2-acetoxypropane; 1-Methoxy-2-propanol acetate; 2-(1-Methoxy)propyl acetate; 2-Methoxy-1-methylethyl acetate; Arcosolv PMA; Dowanol PMA; Ektasolve PM Acetate; PGMEA; 2-Propanol, 1-methoxy-, 2-acetate; NSC 2207

Phase change data

Data compiled as indicated in comments:
BS - Robert L. Brown and Stephen E. Stein
TRC - Thermodynamics Research Center, NIST Boulder Laboratories, Chris Muzny director
Quantity | Value | Units | Method | Reference | Comment |
---|---|---|---|---|---|
Tboil | 418. to 419. | K | N/A | Frinton Laboratories Inc., 1986 | BS |
Quantity | Value | Units | Method | Reference | Comment |
Tc | 597.9 | K | N/A | Teja and Rosenthal, 1991 | Uncertainty assigned by TRC = 1. K; TRC |
Quantity | Value | Units | Method | Reference | Comment |
Pc | 30.10 | bar | N/A | Teja and Rosenthal, 1991 | Uncertainty assigned by TRC = 0.20 bar; TRC |

Van Den Dool and Kratz RI, non-polar column, temperature ramp

Column type | Active phase | I | Reference | Comment |
---|---|---|---|---|
Capillary | VF-5MS | 914. | Zheng, 2011 | 30. m/0.25 mm/0.25 μm, He; Tstart: 60. C; Tend: 270. C |
Capillary | Petrocol DH | 857.3 | Censullo, Jones, et al., 2003 | 50. m/0.25 mm/0.5 μm, He, 35. C @ 10. min, 3. K/min, 200. C @ 10. min |

Van Den Dool and Kratz RI, polar column, temperature ramp

Column type | Active phase | I | Reference | Comment |
---|---|---|---|---|
Capillary | Carbowax | 1238.3 | Censullo, Jones, et al., 2003 | 60. m/0.25 mm/0.5 μm, He, 50. C @ 10. min, 5. K/min, 250. C @ 10. min |

Normal alkane RI, non-polar column, temperature ramp

Column type | Active phase | I | Reference | Comment |
---|---|---|---|---|
Capillary | VF-5 | 870. | Li and Zhao, 2009 | 30. m/0.25 mm/0.25 μm, Helium, 60. C @ 2. min, 10. K/min, 300. C @ 10. min |
Capillary | BP-1 | 843. | Health Safety Executive, 2000 | 50. m/0.22 mm/0.75 μm, He, 5. K/min; Tstart: 50. C; Tend: 200. C |

Normal alkane RI, polar column, temperature ramp

Column type | Active phase | I | Reference | Comment |
---|---|---|---|---|
Capillary | HP-Innowax | 1228. | Soria, Sanz, et al., 2008 | 50. m/0.20 mm/0.20 μm, Helium, 45. C @ 2. min, 4. K/min, 190. C @ 50. min |

References

Frinton Laboratories Inc., 1986
Frinton Laboratories Inc.,
Catalog Number 11, Frinton Laboratories Inc., Vineland, NJ, 1986, 99. [all data]
Teja and Rosenthal, 1991
Teja, A.S.; Rosenthal, D.J.,
The critical pressures and temperatures of ten substances using a low residence time flow apparatus
in Experimental Results for Phase Equilibria and Pure Component Properties, DIPPR DATA Series No. 1, 1991. [all data]
Zheng, 2011
Zheng, Yufang,
Retention Data. NIST Mass Spectrometry Data Center., NIST Mass Spectrometry Data Center, 2011. [all data]
Censullo, Jones, et al., 2003
Censullo, A.C.; Jones, D.R.; Wills, M.T.,
Speciation of the volatile organic compounds (VOCs) in solventborne aerosol coatings by solid phase microextraction-gas chromatography,
J. Coat. Technol., 2003, 75, 936, 47-53, https://doi.org/10.1007/BF02697922
. [all data]
Li and Zhao, 2009
Li, L.; Zhao, J.,
Determination of the volatile composition of Rhodobryum giganteum (Schwaegr.) Par. (Bryaceae) using solid-phase microextraction and gas chromatography / mass spectrometry (GC/MS),
Molecules, 2009, 14, 6, 2195-2201, https://doi.org/10.3390/molecules14062195
. [all data]
Health Safety Executive, 2000
Health Safety Executive,
MDHS 96 Volatile organic compounds in air - Laboratory method using pumed solid sorbent tubes, solvent desorption and gas chromatography
in Methods for the Determination of Hazardous Substances (MDHS) guidance, Crown, Colegate, Norwich, 2000, 1-24, retrieved from http://www.hse.gov.uk/pubns/mdhs/pdfs/mdhs96.pdf. [all data]
Soria, Sanz, et al., 2008
Soria, A.C.; Sanz, J.; Martinez-Castro, I.,
SPME followed by GC-MS: a powerful technique for qualitative analysis of honey volatiles,
Eur. Food Res. Technol., 2008, 1-12. [all data]