Butanoic acid, 3-methyl-, ethyl ester
- Formula: C7H14O2
- Molecular weight: 130.1849
- IUPAC Standard InChIKey: PPXUHEORWJQRHJ-UHFFFAOYSA-N
- CAS Registry Number: 108-64-5
- Chemical structure:
View 3d structure (requires JavaScript / HTML 5) - Other names: Isovaleric acid, ethyl ester; Ethyl isovalerate; Ethyl 3-methylbutanoate; Ethyl 3-methylbutyrate; 3-Methylbutanoic acid ethyl ester; (CH3)2CHCH2C(O)OC2H5; Ethyl iso-pentanoate; Butyric acid, 3-methyl-, ethyl ester; ethyl 3-methylbutanoate (ethyl isovalerate); 3-methyl butyric acid ethyl ester

Phase change data

Data compiled as indicated in comments:
BS - Robert L. Brown and Stephen E. Stein
TRC - Thermodynamics Research Center, NIST Boulder Laboratories, Chris Muzny director
ALS - Hussein Y. Afeefy, Joel F. Liebman, and Stephen E. Stein
DRB - Donald R. Burgess, Jr.
AC - William E. Acree, Jr., James S. Chickos
Quantity | Value | Units | Method | Reference | Comment |
---|---|---|---|---|---|
Tboil | 405.2 | K | N/A | Aldrich Chemical Company Inc., 1990 | BS |
Tboil | 407.9 | K | N/A | Weast and Grasselli, 1989 | BS |
Tboil | 408.55 | K | N/A | Hancock, Watson, et al., 1954 | Uncertainty assigned by TRC = 0.4 K; TRC |
Tboil | 407.9 | K | N/A | Lecat, 1927 | Uncertainty assigned by TRC = 0.5 K; TRC |
Tboil | 407.9 | K | N/A | Lecat, 1927, 2 | Uncertainty assigned by TRC = 0.5 K; TRC |
Quantity | Value | Units | Method | Reference | Comment |
Tc | 582.4 | K | N/A | Young, 1994 | Uncertainty assigned by TRC = 0.6 K; TRC |
Tc | 588.02 | K | N/A | Brown, 1906 | Uncertainty assigned by TRC = 6. K; TRC |
Quantity | Value | Units | Method | Reference | Comment |
ΔvapH° | 44. ± 1. | kJ/mol | V | Hancock, Watson, et al., 1954, 2 | Heat of formation derived by Cox and Pilcher, 1970; ALS |
ΔvapH° | 44.1 | kJ/mol | N/A | Hancock, Watson, et al., 1954, 2 | DRB |
Enthalpy of vaporization
ΔvapH (kJ/mol) | Temperature (K) | Method | Reference | Comment |
---|---|---|---|---|
42.8 | 316. | A | Stephenson and Malanowski, 1987 | Based on data from 301. to 418. K.; AC |
44.5 | 282. | N/A | Stull, 1947 | Based on data from 267. to 407. K.; AC |
Antoine Equation Parameters
log10(P) = A − (B / (T + C))
P = vapor pressure (bar)
T = temperature (K)
View plot Requires a JavaScript / HTML 5 canvas capable browser.
Temperature (K) | A | B | C | Reference | Comment |
---|---|---|---|---|---|
267.1 to 407.5 | 4.65963 | 1711.933 | -39.809 | Stull, 1947 | Coefficents calculated by NIST from author's data. |

Gas phase thermochemistry data

Data compiled by: Hussein Y. Afeefy, Joel F. Liebman, and Stephen E. Stein
Quantity | Value | Units | Method | Reference | Comment |
---|---|---|---|---|---|
ΔfH°gas | -126.0 ± 2.1 | kcal/mol | Ccb | Hancock, Watson, et al., 1954 | Heat of formation derived by Cox and Pilcher, 1970 |

Condensed phase thermochemistry data

Data compiled by: Hussein Y. Afeefy, Joel F. Liebman, and Stephen E. Stein
Quantity | Value | Units | Method | Reference | Comment |
---|---|---|---|---|---|
ΔfH°liquid | -136.5 ± 2.0 | kcal/mol | Ccb | Hancock, Watson, et al., 1954 | Heat of formation derived by Cox and Pilcher, 1970 |
Quantity | Value | Units | Method | Reference | Comment |
ΔcH°liquid | -1000.1 ± 2.0 | kcal/mol | Ccb | Hancock, Watson, et al., 1954 | Reanalyzed by Cox and Pilcher, 1970, Original value = -1000. kcal/mol; Heat of formation derived by Cox and Pilcher, 1970; Corresponding ΔfHºliquid = -136.46 kcal/mol (simple calculation by NIST; no Washburn corrections) |

Van Den Dool and Kratz RI, non-polar column, temperature ramp

Data compiled by: NIST Mass Spectrometry Data Center, William E. Wallace, director

Column type CapillaryCapillaryCapillaryCapillaryCapillary
Active phase SPB-5DB-5DB-5HP-5DB-5
Column length (m) 60.30.30.30.30.
Carrier gas  HeHeN2N2
Substrate
Column diameter (mm) 0.320.320.320.250.32
Phase thickness (μm) 1.0.50.240.251.
Tstart (C) 40.40.40.60.40.
Tend (C) 230.265.240.220.230.
Heat rate (K/min) 3.7.6.5.4.
Initial hold (min) 2. 2.10.2.
Final hold (min) 10.5.10. 10.
I 852.858.854.843.858.
ReferenceEngel and Ratel, 2007Mahattanatawee K., Perez-Cacho P.R., et al., 2007Scheidig, Czerny, et al., 2007Flamini, Tebano, et al., 2006Fang and Qian, 2005
Comment MSDC-RI MSDC-RI MSDC-RI MSDC-RI MSDC-RI
Column type CapillaryCapillaryCapillaryCapillaryCapillary
Active phase HP-5MSCP-Sil 8CB-MSCP-Sil 8CB-MSHP-5CP Sil 5 CB
Column length (m) 30.60.60.30.60.
Carrier gas He  N2He
Substrate
Column diameter (mm) 0.250.250.250.250.32
Phase thickness (μm) 0.250.250.250.250.25
Tstart (C) 60.40.40.60.60.
Tend (C) 250.280.280.220.280.
Heat rate (K/min) 4.4.4.5.3.
Initial hold (min) 2.2.2.10.10.
Final hold (min) 20.5.5. 60.
I 847.849.856.859.824.
ReferencePino, Mesa, et al., 2005Hierro, de la Hoz, et al., 2004Bruna, Hierro, et al., 2003Emilio Tomei, Manganelli, et al., 2003Pino, Almora, et al., 2003
Comment MSDC-RI MSDC-RI MSDC-RI MSDC-RI MSDC-RI
Column type CapillaryCapillaryCapillaryCapillary
Active phase DB-5HP-5MSDB-5CP Sil 5 CB
Column length (m) 60.30.15.50.
Carrier gas HeHe He
Substrate
Column diameter (mm) 0.250.250.320.32
Phase thickness (μm) 0.250.250.50.4
Tstart (C) 40.40.30.60.
Tend (C) 275.200.225.280.
Heat rate (K/min) 7.3.10.3.
Initial hold (min)  5.2.10.
Final hold (min)  20.20.60.
I 839.859.857.824.
ReferenceValim, Rouseff, et al., 2003Kim T.H., Kim T.H., et al., 2002Zhou, Wintersteen, et al., 2002Pino and Marbot, 2001
Comment MSDC-RI MSDC-RI MSDC-RI MSDC-RI

Kovats' RI, non-polar column, custom temperature program

Data compiled by: NIST Mass Spectrometry Data Center, William E. Wallace, director

Column type CapillaryCapillary
Active phase DB-5SE-30
Column length (m) 30.
Carrier gas
Substrate
Column diameter (mm) 0.26
Phase thickness (μm) 0.25
Program not specifiednot specified
I 856.839.
ReferenceAdams, 1998Chretien and Dubois, 1978
Comment MSDC-RI MSDC-RI

References

Aldrich Chemical Company Inc., 1990
Aldrich Chemical Company Inc.,
Catalog Handbook of Fine Chemicals, Aldrich Chemical Company, Inc., Milwaukee WI, 1990, 1. [all data]
Weast and Grasselli, 1989
CRC Handbook of Data on Organic Compounds, 2nd Editon, Weast,R.C and Grasselli, J.G., ed(s)., CRC Press, Inc., Boca Raton, FL, 1989, 1. [all data]
Hancock, Watson, et al., 1954
Hancock, C.K.; Watson, G.M.; Gilby, R.F.,
Heats of Combustion of Five-Carbon Fatty Acids and Their Methyl and Ethyl Esters,
J. Phys. Chem., 1954, 58, 127. [all data]
Lecat, 1927
Lecat, M.,
New binary azeotropes: 7th list,
Ann. Soc. Sci. Bruxelles, Ser. B, 1927, 47, 108-14. [all data]
Lecat, 1927, 2
Lecat, M.,
New binary azeotropes: 6th list,
Ann. Soc. Sci. Bruxelles, Ser. B, 1927, 47, 63-71. [all data]
Young, 1994
Young, C.L.,
Personal Commun. 1994 1994, 1994. [all data]
Brown, 1906
Brown, J.C.,
The critical temperature and value of ml/theta of some carbon compounds,
J. Chem. Soc., Trans., 1906, 89, 311. [all data]
Hancock, Watson, et al., 1954, 2
Hancock, C.K.; Watson, G.M.; Gilby, R.F.,
Heats of combustion of five-carbon fatty acids and their methyl and ethyl esters,
J. Phys. Chem., 1954, 58, 127-129. [all data]
Cox and Pilcher, 1970
Cox, J.D.; Pilcher, G.,
Thermochemistry of Organic and Organometallic Compounds, Academic Press, New York, 1970, 1-636. [all data]
Stephenson and Malanowski, 1987
Stephenson, Richard M.; Malanowski, Stanislaw,
Handbook of the Thermodynamics of Organic Compounds, 1987, https://doi.org/10.1007/978-94-009-3173-2
. [all data]
Stull, 1947
Stull, Daniel R.,
Vapor Pressure of Pure Substances. Organic and Inorganic Compounds,
Ind. Eng. Chem., 1947, 39, 4, 517-540, https://doi.org/10.1021/ie50448a022
. [all data]