Propanedioic acid, dimethyl ester
- Formula: C5H8O4
- Molecular weight: 132.1146
- IUPAC Standard InChIKey: BEPAFCGSDWSTEL-UHFFFAOYSA-N
- CAS Registry Number: 108-59-8
- Chemical structure:
View 3d structure (requires JavaScript / HTML 5) - Other names: Malonic acid, dimethyl ester; Dimethyl malonate; Dimethyl propanedioate; Methyl malonate; Dimethyl ester of malonic acid; Propanedioic acid, 1,3-dimethyl ester

Gas phase thermochemistry data

Data compiled by: Hussein Y. Afeefy, Joel F. Liebman, and Stephen E. Stein
Quantity | Value | Units | Method | Reference | Comment |
---|---|---|---|---|---|
ΔfH°gas | -737.8 ± 1.0 | kJ/mol | Ccb | Verevkin, Beckhaus, et al., 1992 | |
ΔfH°gas | -737.8 ± 1.0 | kJ/mol | Ccb | Verevkin, Dogan, et al., 1990 |

Condensed phase thermochemistry data

Data compiled as indicated in comments:
ALS - Hussein Y. Afeefy, Joel F. Liebman, and Stephen E. Stein
DH - Eugene S. Domalski and Elizabeth D. Hearing
Quantity | Value | Units | Method | Reference | Comment |
---|---|---|---|---|---|
ΔfH°liquid | -799.69 ± 0.63 | kJ/mol | Ccb | Verevkin, Beckhaus, et al., 1992 | ALS |
ΔfH°liquid | -799.69 ± 0.63 | kJ/mol | Ccb | Verevkin, Dogan, et al., 1990 | ALS |
Quantity | Value | Units | Method | Reference | Comment |
ΔcH°liquid | -2311.2 ± 0.63 | kJ/mol | Ccb | Verevkin, Beckhaus, et al., 1992 | Corresponding ΔfHºliquid = -799.73 kJ/mol (simple calculation by NIST; no Washburn corrections); ALS |
ΔcH°liquid | -2311.2 ± 0.63 | kJ/mol | Ccb | Verevkin, Dogan, et al., 1990 | Corresponding ΔfHºliquid = -799.73 kJ/mol (simple calculation by NIST; no Washburn corrections); ALS |
Quantity | Value | Units | Method | Reference | Comment |
ΔcH°solid | -2318. | kJ/mol | Ccb | Verkade, Coops, et al., 1926 | Heat of combustion at 15°C; Corresponding ΔfHºsolid = -792.9 kJ/mol (simple calculation by NIST; no Washburn corrections); ALS |
Constant pressure heat capacity of liquid
Cp,liquid (J/mol*K) | Temperature (K) | Reference | Comment |
---|---|---|---|
210.1 | 298.15 | Verevkin, Beckhaus, et al., 1992 | DH |

Phase change data

Data compiled as indicated in comments:
BS - Robert L. Brown and Stephen E. Stein
TRC - Thermodynamics Research Center, NIST Boulder Laboratories, Chris Muzny director
AC - William E. Acree, Jr., James S. Chickos
ALS - Hussein Y. Afeefy, Joel F. Liebman, and Stephen E. Stein
DRB - Donald R. Burgess, Jr.
Quantity | Value | Units | Method | Reference | Comment |
---|---|---|---|---|---|
Tboil | 454.6 | K | N/A | Weast and Grasselli, 1989 | BS |
Tboil | 454.6 | K | N/A | Lecat, 1947 | Uncertainty assigned by TRC = 0.8 K; TRC |
Tboil | 454.6 | K | N/A | Lecat, 1926 | Uncertainty assigned by TRC = 0.5 K; TRC |
Quantity | Value | Units | Method | Reference | Comment |
Tfus | 211.3 | K | N/A | Palomaa and Mikkila, 1942 | Uncertainty assigned by TRC = 1. K; TRC |
Quantity | Value | Units | Method | Reference | Comment |
ΔvapH° | 57.5 ± 0.3 | kJ/mol | GS | Verevkin, Kozlova, et al., 2006 | Based on data from 278. to 314. K.; AC |
ΔvapH° | 61.84 ± 0.79 | kJ/mol | V | Verevkin, Beckhaus, et al., 1992 | ALS |
ΔvapH° | 61.84 ± 0.79 | kJ/mol | C | Verevkin, Dogan, et al., 1990 | ALS |
ΔvapH° | 61.9 | kJ/mol | N/A | Verevkin, Dogan, et al., 1990 | DRB |
Quantity | Value | Units | Method | Reference | Comment |
ΔsubH° | 111.7 ± 2.1 | kJ/mol | ME | Ribeiro da Silva, Monte, et al., 2000 | AC |
Enthalpy of vaporization
ΔvapH (kJ/mol) | Temperature (K) | Method | Reference | Comment |
---|---|---|---|---|
52.9 ± 0.2 | 360. | EB | Steele, Chirico, et al., 2002 | Based on data from 351. to 460. K.; AC |
49.5 ± 0.2 | 400. | EB | Steele, Chirico, et al., 2002 | Based on data from 351. to 460. K.; AC |
46.1 ± 0.3 | 440. | EB | Steele, Chirico, et al., 2002 | Based on data from 351. to 460. K.; AC |
61.8 ± 0.8 | 293. | GS | Verevkin, Beckhaus, et al., 1992 | Based on data from 278. to 308. K.; AC |
50.0 | 497. | EB,HG | Askonas and Daubert, 1988 | Based on data from 374. to 620. K.; AC |
53.7 | 323. | A | Stephenson and Malanowski, 1987 | Based on data from 308. to 454. K.; AC |
Antoine Equation Parameters
log10(P) = A − (B / (T + C))
P = vapor pressure (bar)
T = temperature (K)
View plot Requires a JavaScript / HTML 5 canvas capable browser.
Temperature (K) | A | B | C | Reference | Comment |
---|---|---|---|---|---|
308. to 453.9 | 5.22732 | 2143.666 | -43.448 | Stull, 1947 | Coefficents calculated by NIST from author's data. |

Reaction thermochemistry data

Data compiled by: John E. Bartmess
Individual Reactions
C5H7O4- + =
By formula: C5H7O4- + H+ = C5H8O4
Quantity | Value | Units | Method | Reference | Comment |
---|---|---|---|---|---|
ΔrH° | 1456. ± 8.8 | kJ/mol | G+TS | Mishima, Matsuoka, et al., 2004 | gas phase; Calc: keto form of acid more stable. |
Quantity | Value | Units | Method | Reference | Comment |
ΔrG° | 1428. ± 8.4 | kJ/mol | IMRE | Mishima, Matsuoka, et al., 2004 | gas phase; Calc: keto form of acid more stable. |

Gas phase ion energetics data

Data compiled by: John E. Bartmess
De-protonation reactions
C5H7O4- + =
By formula: C5H7O4- + H+ = C5H8O4
Quantity | Value | Units | Method | Reference | Comment |
---|---|---|---|---|---|
ΔrH° | 1456. ± 8.8 | kJ/mol | G+TS | Mishima, Matsuoka, et al., 2004 | gas phase; Calc: keto form of acid more stable. |
Quantity | Value | Units | Method | Reference | Comment |
ΔrG° | 1428. ± 8.4 | kJ/mol | IMRE | Mishima, Matsuoka, et al., 2004 | gas phase; Calc: keto form of acid more stable. |

Kovats' RI, non-polar column, isothermal

Column type | Active phase | Temperature (C) | I | Reference | Comment |
---|---|---|---|---|---|
Packed | SE-30 | 150. | 910. | Finkelstein, Kurbatova, et al., 2002 | Column length: 2. m |
Packed | PMS-1000 | 160. | 902. | Kurbatova, Moiseev, et al., 1998 | Chromaton N-AW; Column length: 1. m |
Capillary | SE-54 | 140. | 917. | Grigor'eva, Vasil'ev, et al., 1993 | 15. m/0.28 mm/2.4 μm, Ar |
Capillary | SE-54 | 160. | 915. | Grigor'eva, Vasil'ev, et al., 1993 | 15. m/0.28 mm/2.4 μm, Ar |
Capillary | SE-54 | 180. | 913. | Grigor'eva, Vasil'ev, et al., 1993 | 15. m/0.28 mm/2.4 μm, Ar |
Capillary | Ultra-1 | 100. | 887. | Herrmann, Dufka, et al., 1986 | 25. m/0.20 mm/0.32 μm, N2 |
Capillary | Ultra-1 | 125. | 884. | Herrmann, Dufka, et al., 1986 | 25. m/0.20 mm/0.32 μm, N2 |
Capillary | Ultra-1 | 150. | 882. | Herrmann, Dufka, et al., 1986 | 25. m/0.20 mm/0.32 μm, N2 |
Capillary | Ultra-1 | 75. | 891. | Herrmann, Dufka, et al., 1986 | 25. m/0.20 mm/0.32 μm, N2 |

Kovats' RI, polar column, isothermal

Column type | Active phase | Temperature (C) | I | Reference | Comment |
---|---|---|---|---|---|
Capillary | PEG-40M | 120. | 1482. | Grigor'eva, Vasil'ev, et al., 1993 | 40. m/0.25 mm/0.10 μm, Ar |
Capillary | PEG-40M | 120. | 1484. | Grigor'eva, Vasil'ev, et al., 1993 | 40. m/0.25 mm/0.10 μm, Ar |

Van Den Dool and Kratz RI, non-polar column, temperature ramp

Column type | Active phase | I | Reference | Comment |
---|---|---|---|---|
Capillary | DB-1 | 908. | Wu, Kuo, et al., 1991 | 50. m/0.32 mm/1.05 μm, He, 2. K/min, 260. C @ 40. min; Tstart: 40. C |
Packed | SE-30 | 895. | van den Dool and Kratz, 1963 | Celite; Tstart: 75. C; Tend: 228. C |

Van Den Dool and Kratz RI, polar column, temperature ramp

Column type | Active phase | I | Reference | Comment |
---|---|---|---|---|
Capillary | DB-Wax | 1506. | Umano, Hagi, et al., 1992 | He, 40. C @ 10. min, 2. K/min; Column length: 30. m; Column diameter: 0.25 mm; Tend: 200. C |
Packed | Carbowax 20M | 1489. | van den Dool and Kratz, 1963 | Celite 545, 4.6 K/min; Tstart: 75. C; Tend: 228. C |

Normal alkane RI, non-polar column, isothermal

Column type | Active phase | Temperature (C) | I | Reference | Comment |
---|---|---|---|---|---|
Capillary | OV-101 | 120. | 914. | Lipp, Krasnykh, et al., 2008 | Helium; Column length: 50. m; Column diameter: 0.25 mm |
Capillary | OV-101 | 130. | 917. | Lipp, Krasnykh, et al., 2008 | Helium; Column length: 50. m; Column diameter: 0.25 mm |
Capillary | OV-101 | 140. | 918. | Lipp, Krasnykh, et al., 2008 | Helium; Column length: 50. m; Column diameter: 0.25 mm |
Capillary | OV-101 | 150. | 921. | Lipp, Krasnykh, et al., 2008 | Helium; Column length: 50. m; Column diameter: 0.25 mm |

Normal alkane RI, non-polar column, temperature ramp

Column type | Active phase | I | Reference | Comment |
---|---|---|---|---|
Capillary | DB-1 | 897. | Takeoka and Butter, 1989 | He, 30. C @ 4. min, 2. K/min; Column length: 60. m; Column diameter: 0.32 mm; Tend: 210. C |
Capillary | DB-1 | 899. | Takeoka and Butter, 1989 | He, 30. C @ 4. min, 2. K/min; Column length: 60. m; Column diameter: 0.32 mm; Tend: 210. C |

Normal alkane RI, non-polar column, custom temperature program

Column type | Active phase | I | Reference | Comment |
---|---|---|---|---|
Capillary | SE-30 | 896. | Vinogradov, 2004 | Program: not specified |
Capillary | HP-1 | 888. | Teai, Claude-Lafontaine, et al., 2001 | 50. m/0.32 mm/0.52 μm, N2; Program: 40C => 2C/min => 130C => 4C/min => 250C |
Capillary | PMS-1000 | 902. | Kurbatova, Kolosova, et al., 2000 | Program: not specified |
Capillary | OV-1, SE-30, Methyl silicone, SP-2100, OV-101, DB-1, etc. | 895. | Waggott and Davies, 1984 | Hydrogen; Column length: 50. m; Column diameter: 0.32 mm; Program: not specified |

Normal alkane RI, polar column, temperature ramp

Column type | Active phase | I | Reference | Comment |
---|---|---|---|---|
Capillary | DB-Wax | 1499. | Takeoka and Butter, 1989 | 60. m/0.32 mm/0.25 μm, He, 30. C @ 4. min, 2. K/min; Tend: 180. C |
Capillary | DB-Wax | 1500. | Takeoka and Butter, 1989 | 60. m/0.32 mm/0.25 μm, He, 30. C @ 4. min, 2. K/min; Tend: 180. C |

Normal alkane RI, polar column, custom temperature program

Column type | Active phase | I | Reference | Comment |
---|---|---|---|---|
Capillary | Carbowax 20M | 1472. | Vinogradov, 2004 | Program: not specified |
Capillary | Carbowax 20M | 1523. | Teai, Claude-Lafontaine, et al., 2001 | 50. m/0.2 mm/0.2 μm, N2; Program: 60C => 2C/min => 150C => 4C/min => 220C |
Capillary | Carbowax 400, Carbowax 20M, Carbowax 1540, Carbowax 4000, Superox 06, PEG 20M, etc. | 1489. | Waggott and Davies, 1984 | Hydrogen; Column length: 50. m; Column diameter: 0.32 mm; Program: not specified |

References

Verevkin, Beckhaus, et al., 1992
Verevkin, S.P.; Beckhaus, H.-D.; Ruchardt, C.,
Geminale substituenteneffekte Teil 5α. Standardbildungsenthalpien von alkylsubstituierten Malonsaure- und α-aminocarbonsaureestern,
Thermochim. Acta, 1992, 197, 27-39. [all data]
Verevkin, Dogan, et al., 1990
Verevkin, S.; Dogan, B.; Beckhaus, H.D.; Ruechardt, C.,
Geminal substituent effects. 3. Synergistic destablization by geminal ester groups,
Angew. Chem., 1990, 102, 693-695. [all data]
Verkade, Coops, et al., 1926
Verkade, P.E.; Coops, J.; Hartman, H.,
Calorimetric researches. XIII. Heats of combustion of successive terms of homologous series: Dimethyl esters of the oxalic acid series. A general survey of the oscillation phenomena,
Recl. Trav. Chim. Pays-Bas, 1926, 45, 585-606. [all data]
Weast and Grasselli, 1989
CRC Handbook of Data on Organic Compounds, 2nd Editon, Weast,R.C and Grasselli, J.G., ed(s)., CRC Press, Inc., Boca Raton, FL, 1989, 1. [all data]
Lecat, 1947
Lecat, M.,
Orthobaric Azeotropes of Sulfides,
Bull. Cl. Sci., Acad. R. Belg., 1947, 33, 160-82. [all data]
Lecat, 1926
Lecat, M.,
New binary azeotropes: 3rd list,
Ann. Soc. Sci. Bruxelles, Ser. B, 1926, 45, 284-94. [all data]
Palomaa and Mikkila, 1942
Palomaa, M.H.; Mikkila, I.,
Etherlike Compounds XXVII Turbid Phases in Compounds with Reactivity Minimums,
Chem. Ber., 1942, 75B, 1659-67. [all data]
Verevkin, Kozlova, et al., 2006
Verevkin, Sergey P.; Kozlova, Svetlana A.; Emel'yanenko, Vladimir N.; Nikitin, Eugene D.; Popov, Alexander P.; Krasnykh, Eugen L.,
Vapor Pressures, Enthalpies of Vaporization, and Critical Parameters of a Series of Linear Aliphatic Dimethyl Esters of Dicarboxylic Acids,
J. Chem. Eng. Data, 2006, 51, 5, 1896-1905, https://doi.org/10.1021/je0602418
. [all data]
Ribeiro da Silva, Monte, et al., 2000
Ribeiro da Silva, Manuel A.V.; Monte, Manuel J.S.; Ribeiro, José R.,
Standard Enthalpies, Entropies, and Gibbs Functions of Sublimation of Four Alkyl-Substituted Malonic Acids,
J. Chem. Eng. Data, 2000, 45, 5, 756-759, https://doi.org/10.1021/je000090n
. [all data]
Steele, Chirico, et al., 2002
Steele, W.V.; Chirico, R.D.; Cowell, A.B.; Knipmeyer, S.E.; Nguyen, A.,
Thermodynamic Properties and Ideal-Gas Enthalpies of Formation for 1,4-Diisopropylbenzene, 1,2,4,5-Tetraisopropylbenzene, Cyclohexanone Oxime, Dimethyl Malonate, Glutaric Acid, and Pimelic Acid,
J. Chem. Eng. Data, 2002, 47, 4, 725-739, https://doi.org/10.1021/je010088b
. [all data]
Askonas and Daubert, 1988
Askonas, Charles F.; Daubert, Thomas E.,
Vapor pressure determination of eight oxygenated compounds,
J. Chem. Eng. Data, 1988, 33, 3, 225-229, https://doi.org/10.1021/je00053a001
. [all data]
Stephenson and Malanowski, 1987
Stephenson, Richard M.; Malanowski, Stanislaw,
Handbook of the Thermodynamics of Organic Compounds, 1987, https://doi.org/10.1007/978-94-009-3173-2
. [all data]
Stull, 1947
Stull, Daniel R.,
Vapor Pressure of Pure Substances. Organic and Inorganic Compounds,
Ind. Eng. Chem., 1947, 39, 4, 517-540, https://doi.org/10.1021/ie50448a022
. [all data]
Mishima, Matsuoka, et al., 2004
Mishima, M.; Matsuoka, M.; Lei, Y.X.; Rappoport, Z.,
Gas-phase acidities of disubstituted methanes and of enols of carboxamides substituted by electron-withdrawing groups,
J. Org. Chem., 2004, 69, 18, 5947-5965, https://doi.org/10.1021/jo040196b
. [all data]
Finkelstein, Kurbatova, et al., 2002
Finkelstein, E.E.; Kurbatova, S.V.; Maryashina, O.I.; Moiseev, I.K.; Kolosova, E.A.,
Chromatographical identification of adamantane series ketones synthesis intermediary products,
Proc. Samara State Univ., 2002, 26, 4, 129-136. [all data]
Kurbatova, Moiseev, et al., 1998
Kurbatova, S.V.; Moiseev, I.K.; Klimochkin, Yu.N.; Arutyunov, Yu.N.,
Chromatography analysis of intermediates in the synthesis of remantadin,
J. Anal. Chem. USSR (Engl. Transl.), 1998, 53, 9, 865-868. [all data]
Grigor'eva, Vasil'ev, et al., 1993
Grigor'eva, D.N.; Vasil'ev, A.V.; Golovnya, R.V.,
Effect of the temperature on the retention indices in homologous series of bifunctional compounds under capillary gas chromatography conditions,
J. Anal. Chem. USSR (Engl. Transl.), 1993, 48, 7, 817-822. [all data]
Herrmann, Dufka, et al., 1986
Herrmann, F.; Dufka, O.; Churacek, J.,
Fused-Silica Capillary Gas Chromatography-Mass Spectrometry of Some Dicarboxylic Acids Present in Condensation-Type Polymers I. Dimethyl Esters,
J. Chromatogr., 1986, 360, 79-88, https://doi.org/10.1016/S0021-9673(00)91653-4
. [all data]
Wu, Kuo, et al., 1991
Wu, P.; Kuo, M.-C.; Hartman, T.G.; Rosen, R.T.; Ho, C.-T.,
Free and glycosidically bound aroma compounds in pineapple (Ananas comosus L. Merr.),
J. Agric. Food Chem., 1991, 39, 1, 170-172, https://doi.org/10.1021/jf00001a033
. [all data]
van den Dool and Kratz, 1963
van den Dool, H.; Kratz, P. Dec.,
A generalization of the retention index system including linear temperature programmed gas-liquid partition chromatography,
J. Chromatogr., 1963, 11, 463-471, https://doi.org/10.1016/S0021-9673(01)80947-X
. [all data]
Umano, Hagi, et al., 1992
Umano, K.; Hagi, Y.; Nakahara, K.; Shoji, A.; Shibamoto, T.,
Volatile constituents of green and ripened pineapple (Aanas comosus [L.] Merr.),
J. Agric. Food Chem., 1992, 40, 4, 599-603, https://doi.org/10.1021/jf00016a014
. [all data]
Lipp, Krasnykh, et al., 2008
Lipp, S.V.; Krasnykh, E.L.; Levanova, S.V.,
Retention indices of symmetrical dicarboxylic acid esters,
Rus. J. Anal. Chem., 2008, 63, 4, 349-352, https://doi.org/10.1134/S1061934808040072
. [all data]
Takeoka and Butter, 1989
Takeoka, G.; Butter, R.G.,
Volatile constituents of pineapple (Ananas Comosus [L.] Merr.)
in Flavor Chemistry. Trends and Developments, Teranishi,R.; Buttery,R.G.; Shahidi,F., ed(s)., American Chemical Society, Washington, DC, 1989, 223-237. [all data]
Vinogradov, 2004
Vinogradov, B.A.,
Production, composition, properties and application of essential oils, 2004, retrieved from http://viness.narod.ru. [all data]
Teai, Claude-Lafontaine, et al., 2001
Teai, T.; Claude-Lafontaine, A.; Schippa, C.; Cozzolino, F.,
Volatile compounds in fresh pulp of pineapple (Ananas comosus [L.] Merr.) from French Polynesia,
J. Essent. Oil Res., 2001, 13, 5, 314-318, https://doi.org/10.1080/10412905.2001.9712222
. [all data]
Kurbatova, Kolosova, et al., 2000
Kurbatova, S.; Kolosova, E.; Solovova, N.; Finkelshtein, E.; Zemtsova, M.,
Gas-chromatographic investigation of adamantane oxygen derivatives,
Vestn. Samara State Univ., 2000, 4, 18, 167-172. [all data]
Waggott and Davies, 1984
Waggott, A.; Davies, I.W.,
Identification of organic pollutants using linear temperature programmed retention indices (LTPRIs) - Part II, 1984, retrieved from http://dwi.defra.gov.uk/research/completed-research/reports/dwi0383.pdf. [all data]