1,3-Benzenediol, diacetate
- Formula: C10H10O4
- Molecular weight: 194.1840
- IUPAC Standard InChIKey: STOUHHBZBQBYHH-UHFFFAOYSA-N
- CAS Registry Number: 108-58-7
- Chemical structure:
View 3d structure (requires JavaScript / HTML 5) - Other names: Resorcinol, diacetate; m-Phenylenediacetate; 1,3-Diacetoxybenzene; 1,3-Dihydroxybenzene diacetate; 3-Phenylenediacetate; Resorcinyl diacetate; 1,3-Benzenediol, 1,3-diacetate; NSC 4885; Dihydroxybenzene diacetate; Resorcinyl acetate; 3-(Acetyloxy)phenyl acetate

Phase change data

Data compiled by: Robert L. Brown and Stephen E. Stein
Quantity | Value | Units | Method | Reference | Comment |
---|---|---|---|---|---|
Tboil | 551.2 | K | N/A | Weast and Grasselli, 1989 | |
Tboil | 551. | K | N/A | Buckingham and Donaghy, 1982 |
Reduced pressure boiling point
Tboil (K) | Pressure (bar) | Reference |
---|---|---|
419.2 | 0.016 | Aldrich Chemical Company Inc., 1990 |

Van Den Dool and Kratz RI, non-polar column, custom temperature program

Column type | Active phase | I | Reference | Comment |
---|---|---|---|---|
Capillary | VF-5MS | 1444.9 | Tret'yakov, 2008 | 30. m/0.25 mm/0.25 μm, He; Program: Multi-step temperature program; T(initial)=60C; T(final)=270C |
Packed | SE-30 | 1420. | Peng, Ding, et al., 1988 | Supelcoport; Chromosorb; Column length: 3.05 m; Program: 40C(5min) => 10C/min => 200C or 250C (60min) |

Normal alkane RI, polar column, custom temperature program

Column type | Active phase | I | Reference | Comment |
---|---|---|---|---|
Capillary | DB-Wax | 2301. | Peng, Yang, et al., 1991 | Program: not specified |

References

Weast and Grasselli, 1989
CRC Handbook of Data on Organic Compounds, 2nd Editon, Weast,R.C and Grasselli, J.G., ed(s)., CRC Press, Inc., Boca Raton, FL, 1989, 1. [all data]
Buckingham and Donaghy, 1982
Buckingham, J.; Donaghy, S.M.,
Dictionary of Organic Compounds: Fifth Edition, Chapman and Hall, New York, 1982, 1. [all data]
Aldrich Chemical Company Inc., 1990
Aldrich Chemical Company Inc.,
Catalog Handbook of Fine Chemicals, Aldrich Chemical Company, Inc., Milwaukee WI, 1990, 1. [all data]
Tret'yakov, 2008
Tret'yakov, K.V.,
Retention Data. NIST Mass Spectrometry Data Center., NIST Mass Spectrometry Data Center, 2008. [all data]
Peng, Ding, et al., 1988
Peng, C.T.; Ding, S.F.; Hua, R.L.; Yang, Z.C.,
Prediction of Retention Indexes I. Structure-Retention Index Relationship on Apolar Columns,
J. Chromatogr., 1988, 436, 137-172, https://doi.org/10.1016/S0021-9673(00)94575-8
. [all data]
Peng, Yang, et al., 1991
Peng, C.T.; Yang, Z.C.; Ding, S.F.,
Prediction of rentention idexes. II. Structure-retention index relationship on polar columns,
J. Chromatogr., 1991, 586, 1, 85-112, https://doi.org/10.1016/0021-9673(91)80028-F
. [all data]