(E)-γ-Atlantone
- Formula: C15H22O
- Molecular weight: 218.3346
- IUPAC Standard InChIKey: QEAHSEZXAQIWSW-YPKPFQOOSA-N
- CAS Registry Number: 108549-47-9
- Chemical structure:
View 3d structure (requires JavaScript / HTML 5) - Stereoisomers:
- Other names: (E)-2-Methyl-6-(4-methylcyclohex-3-en-1-ylidene)hept-2-en-4-one; 2-Hepten-4-one, 2-methyl-6-(4-methyl-3-cyclohexen-1-ylidene)-, (6E)-; 2-Hepten-4-one, 2-methyl-6-(4-methyl-3-cyclohexen-1-ylidene)-, (E)-; γ-(E)-Atlantone; γ-Atlantone (E)

Van Den Dool and Kratz RI, non-polar column, custom temperature program

Column type | Active phase | I | Reference | Comment |
---|---|---|---|---|
Capillary | HP-5MS | 1711.5 | Andriamaharavo, 2014 | 30. m/0.25 mm/0.25 μm, He; Program: 60C (1 min) => 5 C/min => 210C => 10 C/min => 280C (15 min) |

Normal alkane RI, non-polar column, custom temperature program

Column type | Active phase | I | Reference | Comment |
---|---|---|---|---|
Capillary | SE-30 | 1691. | Vinogradov, 2004 | Program: not specified |
Capillary | Polydimethyl siloxanes | 1691. | Zenkevich, 1997 | Program: not specified |

References

Andriamaharavo, 2014
Andriamaharavo, N.R.,
Retention Data. NIST Mass Spectrometry Data Center., NIST Mass Spectrometry Data Center, 2014. [all data]
Vinogradov, 2004
Vinogradov, B.A.,
Production, composition, properties and application of essential oils, 2004, retrieved from http://viness.narod.ru. [all data]
Zenkevich, 1997
Zenkevich, I.G.,
Analytical Parameters of Components of Essential Oils for their Chromatographic and Chromato-Spectral Identificaiton. Oxsigenated derivatives of Mono- and Sesquiterpene Hydrocarbons,
Rastit, Resursy (Rus.), 1997, 33, 1, 16-28. [all data]