3-Hydroxy-1,2-diphenyl-3-propen-1-one
- Formula: C15H12O2
- Molecular weight: 224.2546
- CAS Registry Number: 108478-16-6

Condensed phase thermochemistry data

Data compiled by: Hussein Y. Afeefy, Joel F. Liebman, and Stephen E. Stein
Quantity | Value | Units | Method | Reference | Comment |
---|---|---|---|---|---|
ΔfH°solid | -50.7 | kcal/mol | Ccb | Moureu, 1930 | |
Quantity | Value | Units | Method | Reference | Comment |
ΔcH°solid | -1777.8 | kcal/mol | Ccb | Moureu, 1930 | Corresponding ΔfHºsolid = -42.9 kcal/mol (simple calculation by NIST; no Washburn corrections) |

References

Moureu, 1930
Moureu, M.H.,
Des sur la tautomerie des dicetones α,
Ann. Chem., 1930, 14, 283-405. [all data]