Resorcinol
- Formula: C6H6O2
- Molecular weight: 110.1106
- IUPAC Standard InChIKey: GHMLBKRAJCXXBS-UHFFFAOYSA-N
- CAS Registry Number: 108-46-3
- Chemical structure:
View 3d structure (requires JavaScript / HTML 5) - Other names: 1,3-Benzenediol; α-Resorcinol; m-Benzenediol; m-Dihydroxybenzene; m-Dioxybenzene; m-Hydroquinone; m-Hydroxyphenol; Benzene, 1,3-dihydroxy-; C.I. Developer 4; C.I. Oxidation Base 31; C.I. 76505; Developer O; Developer R; Developer RS; Durafur Developer G; Fouramine RS; Fourrine EW; Fourrine 79; Nako TGG; Pelagol Grey RS; Pelagol RS; Resorcin; 1,3-Dihydroxybenzene; 3-Hydroxyphenol; Benzene, m-dihydroxy-; Phenol, m-hydroxy-; NCI-C05970; Rcra waste number U201; Resorcine; UN 2876; NSC 1571; Rodol RS; 1,3-Dihydroxybenzene (resorcinol)

Gas phase thermochemistry data

Data compiled as indicated in comments:
ALS - Hussein Y. Afeefy, Joel F. Liebman, and Stephen E. Stein
DRB - Donald R. Burgess, Jr.
GT - Glushko Thermocenter, Russian Academy of Sciences, Moscow
Quantity | Value | Units | Method | Reference | Comment |
---|---|---|---|---|---|
ΔfH°gas | -284.7 ± 1.2 | kJ/mol | Ccr | Sabbah and Buluku, 1991 | ΔHfusion =15.25±0.52 kJ/mol; ALS |
ΔfH°gas | -275. | kJ/mol | Ccb | Desai, Wilhoit, et al., 1968 | ALS |
ΔfH°gas | -265.2 | kJ/mol | N/A | Pushin, 1954 | Value computed using ΔfHsolid° value of -351.2 kj/mol from Pushin, 1954 and ΔsubH° value of 86.0 kj/mol from Sabbah and Buluku, 1991.; DRB |
Constant pressure heat capacity of gas
Cp,gas (J/mol*K) | Temperature (K) | Reference | Comment |
---|---|---|---|
34.69 | 50. | Kudchadker S.A., 1979 | GT |
47.46 | 100. | ||
65.81 | 150. | ||
85.45 | 200. | ||
114.24 | 273.15 | ||
123.75 | 298.15 | ||
124.44 | 300. | ||
158.69 | 400. | ||
185.86 | 500. | ||
206.73 | 600. | ||
222.95 | 700. | ||
235.90 | 800. | ||
246.52 | 900. | ||
255.42 | 1000. | ||
262.97 | 1100. | ||
269.45 | 1200. | ||
275.04 | 1300. | ||
279.88 | 1400. | ||
284.11 | 1500. |

Reaction thermochemistry data

Data compiled by: John E. Bartmess
Individual Reactions
C6H5O2- + =
By formula: C6H5O2- + H+ = C6H6O2
Quantity | Value | Units | Method | Reference | Comment |
---|---|---|---|---|---|
ΔrH° | 1450. ± 8.8 | kJ/mol | G+TS | Fujio, McIver, et al., 1981 | gas phase; value altered from reference due to change in acidity scale |
ΔrH° | 1444. ± 11. | kJ/mol | G+TS | Kebarle and McMahon, 1977 | gas phase |
Quantity | Value | Units | Method | Reference | Comment |
ΔrG° | 1422. ± 8.4 | kJ/mol | IMRE | Fujio, McIver, et al., 1981 | gas phase; value altered from reference due to change in acidity scale |
ΔrG° | 1415. ± 8.4 | kJ/mol | IMRE | Kebarle and McMahon, 1977 | gas phase |

Henry's Law data

Data compiled by: Rolf Sander
Henry's Law constant (water solution)
kH(T) = k°H exp(d(ln(kH))/d(1/T) ((1/T) - 1/(298.15 K)))
k°H = Henry's law constant for solubility in water at 298.15 K (mol/(kg*bar))
d(ln(kH))/d(1/T) = Temperature dependence constant (K)
k°H (mol/(kg*bar)) | d(ln(kH))/d(1/T) (K) | Method | Reference |
---|---|---|---|
8.2×10+6 | 6300. | X | N/A |

Lee's RI, non-polar column, custom temperature program

Data compiled by: NIST Mass Spectrometry Data Center, William E. Wallace, director

Column type Capillary
Active phase Polydimethyl siloxanes
Column length (m)
Carrier gas
Substrate
Column diameter (mm)
Phase thickness (μm)
Program not specified
I 219.64
ReferenceEckel and Kind, 2003
Comment MSDC-RI

Normal alkane RI, non-polar column, custom temperature program

Data compiled by: NIST Mass Spectrometry Data Center, William E. Wallace, director

Column type Capillary
Active phase SE-30
Column length (m)
Carrier gas
Substrate
Column diameter (mm)
Phase thickness (μm)
Program not specified
I 1368.
ReferencePeterson, 1992
Comment MSDC-RI

Condensed phase thermochemistry data

Data compiled as indicated in comments:
ALS - Hussein Y. Afeefy, Joel F. Liebman, and Stephen E. Stein
DH - Eugene S. Domalski and Elizabeth D. Hearing

Quantity Value Units Method Reference Comment
Δfsolid-88.60 ± 0.26kcal/molCcrSabbah and Buluku, 1991ΔHfusion =15.25±0.52 kJ/mol; ALS
Δfsolid-87.95 ± 0.12kcal/molCcbDesai, Wilhoit, et al., 1968crystal phase; ALS
Δfsolid-83.94kcal/molCcbPushin, 1954Author's hf298_condensed=-85.6 kcal/mol; ALS
Quantity Value Units Method Reference Comment
Δcsolid-680.66 ± 0.26kcal/molCcrSabbah and Buluku, 1991ΔHfusion =15.25±0.52 kJ/mol; Corresponding Δfsolid = -88.60 kcal/mol (simple calculation by NIST; no Washburn corrections); ALS
Δcsolid-681.30 ± 0.10kcal/molCcbDesai, Wilhoit, et al., 1968crystal phase; Corresponding Δfsolid = -87.95 kcal/mol (simple calculation by NIST; no Washburn corrections); ALS
Δcsolid-685.3kcal/molCcbPushin, 1954Author's hf298_condensed=-85.6 kcal/mol; Corresponding Δfsolid = -84.0 kcal/mol (simple calculation by NIST; no Washburn corrections); ALS
Δcsolid-683.9kcal/molCcbBarker, 1925Author was aware that data differs from previously reported values; Corresponding Δfsolid = -85.4 kcal/mol (simple calculation by NIST; no Washburn corrections); ALS

Constant pressure heat capacity of solid

Cp,solid (cal/mol*K) Temperature (K) Reference Comment
32.392298.15Bret-Dibat and Lichanot, 1989T = 200 to 500 K. Cp(c) = 126.876 + 0.3316t + 5.6228x10-4t2 + 9.5321x10-6t3 J/mol*K (t/°C). Cp value caluclated from equation.; DH
33.29298.15Ueberreiter and Orthmann, 1950T = 293 to 368 K. Equation only.; DH
36.09323.Satoh and Sogabe, 1941T = 0 to 100°C. Mean value.; DH
31.31298.Andrews, Lynn, et al., 1926T = 22 to 200°C.; DH
31.41297.9Andrews, 1926T = 110 to 344 K. Value is unsmoothed experimental datum.; DH

Phase change data

Data compiled as indicated in comments:
BS - Robert L. Brown and Stephen E. Stein
TRC - Thermodynamics Research Center, NIST Boulder Laboratories, Chris Muzny director
AC - William E. Acree, Jr., James S. Chickos
ALS - Hussein Y. Afeefy, Joel F. Liebman, and Stephen E. Stein
DRB - Donald R. Burgess, Jr.
DH - Eugene S. Domalski and Elizabeth D. Hearing
CAL - James S. Chickos, William E. Acree, Jr., Joel F. Liebman, Students of Chem 202 (Introduction to the Literature of Chemistry), University of Missouri -- St. Louis

Quantity Value Units Method Reference Comment
Tboil550.KN/ABuckingham and Donaghy, 1982BS
Tboil549.1KN/AKrupatkin and Rozhentsova, 1971Uncertainty assigned by TRC = 0.4 K; TRC
Tboil554.55KN/ALecat, 1943Uncertainty assigned by TRC = 0.5 K; TRC
Quantity Value Units Method Reference Comment
Tfus384. ± 5.KAVGN/AAverage of 7 values; Individual data points
Quantity Value Units Method Reference Comment
Ttriple383.54KN/ASabbah and Buluku, 1991, 2Crystal phase 1 phase; Uncertainty assigned by TRC = 0.02 K; TRC
Ttriple382.7KN/AEbisuzaki, Askari, et al., 1987Crystal phase 1 phase; Uncertainty assigned by TRC = 0.2 K; TRC
Ttriple382.8KN/AAndrews, Lynn, et al., 1926, 2Uncertainty assigned by TRC = 0.25 K; obtained from cooling curve in absence of air; TRC
Quantity Value Units Method Reference Comment
Δvap18.7 ± 0.31kcal/molN/AVerevkin and Kozlova, 2008AC
Quantity Value Units Method Reference Comment
Δsub20.55 ± 0.12kcal/molCSabbah and Buluku, 1991ΔHfusion =15.25±0.52 kJ/mol; ALS
Δsub20.6kcal/molN/ASabbah and Buluku, 1991DRB
Δsub20.9 ± 0.1kcal/molCSabbah and Buluku, 1991AC
Δsub22.2kcal/molN/ADesai, Wilhoit, et al., 1968DRB

Reduced pressure boiling point

Tboil (K) Pressure (atm) Reference Comment
451.20.021Weast and Grasselli, 1989BS

Enthalpy of vaporization

ΔvapH (kcal/mol) Temperature (K) Method Reference Comment
17.8434.AStephenson and Malanowski, 1987Based on data from 419. - 550. K.; AC
17.8407.GCStephenson and Malanowski, 1987Based on data from 392. - 463. K. See also Kundel, Lille, et al., 1975.; AC

Antoine Equation Parameters

log10(P) = A − (B / (T + C))
    P = vapor pressure (atm)
    T = temperature (K)

View plot Requires a JavaScript / HTML 5 canvas capable browser.

Temperature (K) A B C Reference Comment
424.7 - 549.75.516772687.152-62.164von Terres, Gebert, et al., 1955Coefficents calculated by NIST from author's data.

Enthalpy of sublimation

ΔsubH (kcal/mol) Temperature (K) Method Reference Comment
20.4 ± 0.1334.CSabbah and Buluku, 1991AC
22.1353.GSBender, Bieling, et al., 1983Based on data from 328. - 379. K.; AC
22.3 ± 5.0324. - 335.N/ADesai, Wilhoit, et al., 1968AC
22.3303.N/AHoyer and Peperle, 1958Based on data from 283. - 323. K.; AC
22.8 ± 0.3329.VWolf and Weghofer, 1938ALS

Enthalpy of fusion

ΔfusH (kcal/mol) Temperature (K) Method Reference Comment
4.8996381.N/AViikna, Gambino, et al., 1982DH
4.52382.6N/ABret-Dibat and Lichanot, 1989AC
5.0908382.8N/AAndrews, Lynn, et al., 1926DH
5.09382.9CAndrews, Lynn, et al., 1926AC

Entropy of fusion

ΔfusS (cal/mol*K) Temperature (K) Reference Comment
12.9381.Viikna, Gambino, et al., 1982DH
13.3382.8Andrews, Lynn, et al., 1926DH

Entropy of fusion

ΔfusS (cal/mol*K) Temperature (K) Reference Comment
0.782366.8Bret-Dibat and Lichanot, 1989, 2CAL
11.81382.6

Enthalpy of phase transition

ΔHtrs (kcal/mol) Temperature (K) Initial Phase Final Phase Reference Comment
0.3274369.crystaline, IIcrystaline, IEbisuzaki, Askari, et al., 1987, 2DH
4.9928382.7crystaline, IliquidEbisuzaki, Askari, et al., 1987, 2DH
0.2868366.75crystaline, IIcrystaline, IBret-Dibat and Lichanot, 1989DH
4.5172382.55crystaline, IliquidBret-Dibat and Lichanot, 1989DH

Entropy of phase transition

ΔStrs (cal/mol*K) Temperature (K) Initial Phase Final Phase Reference Comment
0.887369.crystaline, II, àcrystaline, I, á phase transitionEbisuzaki, Askari, et al., 1987, 2DH
13.05382.7crystaline, I, Fusion of áliquid, resorcinolEbisuzaki, Askari, et al., 1987, 2DH
0.79366.75crystaline, IIcrystaline, IBret-Dibat and Lichanot, 1989DH
14.382.55crystaline, IliquidBret-Dibat and Lichanot, 1989DH

In addition to the Thermodynamics Research Center (TRC) data available from this site, much more physical and chemical property data is available from the following TRC products:

Kovats' RI, non-polar column, temperature ramp

Data compiled by: NIST Mass Spectrometry Data Center, William E. Wallace, director

Column type Packed
Active phase OV-101
Column length (m)
Carrier gas
Substrate
Column diameter (mm)
Phase thickness (μm)
Tstart (C) 70.
Tend (C) 220.
Heat rate (K/min) 6.
Initial hold (min)
Final hold (min)
I 1376.
ReferenceAlley and Dykes, 1972
Comment MSDC-RI

Kovats' RI, non-polar column, isothermal

Data compiled by: NIST Mass Spectrometry Data Center, William E. Wallace, director

Column type Packed
Active phase OV-1
Column length (m) 2.1
Carrier gas
Substrate Chromosorb W HMDS (100-120 mesh)
Column diameter (mm)
Phase thickness (μm)
Temperature (C) 180.
I 1379.
ReferenceRadecki and Grzybowski, 1978
Comment MSDC-RI

References

Sabbah and Buluku, 1991
Sabbah, R.; Buluku, E.N.L.E.,
Thermodynamic study of three isomers of dihydroxybenzene,
Can. J. Chem., 1991, 69, 481-488. [all data]
Desai, Wilhoit, et al., 1968
Desai, P.D.; Wilhoit, R.C.; Zwolinski, B.J.,
Heat of combustion of resorcinol and enthalpies of isomerization of dihydroxybenzenes,
J. Chem. Eng. Data, 1968, 13, 334-335. [all data]
Pushin, 1954
Pushin, N.A.,
Heats of combustion and heats of formation of isomeric organic compounds,
Bull. Soc. Chim. Belgrade, 1954, 19, 531-547. [all data]
Kudchadker S.A., 1979
Kudchadker S.A.,
Ideal gas thermodynamic properties of benzene diols: pyrocatechol, resorcinol, and hydroquinone,
Thermochim. Acta, 1979, 30, 319-326. [all data]
Fujio, McIver, et al., 1981
Fujio, M.; McIver, R.T., Jr.; Taft, R.W.,
Effects on the acidities of phenols from specific substituent-solvent interactions. Inherent substituent parameters from gas phase acidities,
J. Am. Chem. Soc., 1981, 103, 4017. [all data]
Kebarle and McMahon, 1977
Kebarle, P.; McMahon, T.B.,
Intrinsic Acidities of Substituted Phenols and Benzoic Acids Determined by Gas Phase Proton Transfer Equilibria,
J. Am. Chem. Soc., 1977, 99, 7, 2222, https://doi.org/10.1021/ja00449a032
. [all data]