Benzene, 1,1'-(1,4-butanediyl)bis-
- Formula: C16H18
- Molecular weight: 210.3141
- IUPAC Standard InChIKey: GLJFYGFBITUZOE-UHFFFAOYSA-N
- CAS Registry Number: 1083-56-3
- Chemical structure:
View 3d structure (requires JavaScript / HTML 5) - Other names: Butane, 1,4-diphenyl-; 1,4-Diphenylbutane; 1,4-Diphenyl-n-butane

Condensed phase thermochemistry data

Data compiled by: Hussein Y. Afeefy, Joel F. Liebman, and Stephen E. Stein
Quantity | Value | Units | Method | Reference | Comment |
---|---|---|---|---|---|
ΔcH°solid | -8858.7 ± 2.0 | kJ/mol | Ccb | Coops, Hoijtink, et al., 1953 | Reanalyzed by Cox and Pilcher, 1970, Original value = -8858. ± 2. kJ/mol; Corresponding ΔfHºsolid = -9.93 kJ/mol (simple calculation by NIST; no Washburn corrections) |
ΔcH°solid | -8912. | kJ/mol | Ccb | Serijan and Wise, 1952 | Corresponding ΔfHºsolid = 42. kJ/mol (simple calculation by NIST; no Washburn corrections) |
ΔcH°solid | -9121.1 | kJ/mol | Ccb | Wise, Serijan, et al., 1951 | Corresponding ΔfHºsolid = 252. kJ/mol (simple calculation by NIST; no Washburn corrections) |

Phase change data

Data compiled as indicated in comments:
BS - Robert L. Brown and Stephen E. Stein
TRC - Thermodynamics Research Center, NIST Boulder Laboratories, Chris Muzny director
Quantity | Value | Units | Method | Reference | Comment |
---|---|---|---|---|---|
Tboil | 590.2 | K | N/A | Weast and Grasselli, 1989 | BS |
Tboil | 589.06 | K | N/A | Serijan and Wise, 1952, 2 | Uncertainty assigned by TRC = 0.2 K; TRC |
Quantity | Value | Units | Method | Reference | Comment |
Tfus | 326. ± 3. | K | AVG | N/A | Average of 9 values; Individual data points |

Reaction thermochemistry data

Data compiled by: Hussein Y. Afeefy, Joel F. Liebman, and Stephen E. Stein
Individual Reactions
By formula: 2H2 + C16H14 = C16H18
Quantity | Value | Units | Method | Reference | Comment |
---|---|---|---|---|---|
ΔrH° | -184.26 ± 0.62 | kJ/mol | Chyd | Williams, 1942 | liquid phase; solvent: Acetic acid; At 302 K |
By formula: 4H2 + C16H10 = C16H18
Quantity | Value | Units | Method | Reference | Comment |
---|---|---|---|---|---|
ΔrH° | -495.8 ± 4.1 | kJ/mol | Chyd | Davis, Allinger, et al., 1985 | liquid phase; solvent: Hexane |

Gas phase ion energetics data

Data evaluated by: Edward P. Hunter and Sharon G. Lias
Quantity | Value | Units | Method | Reference | Comment |
---|---|---|---|---|---|
Proton affinity (review) | 822.0 | kJ/mol | N/A | Hunter and Lias, 1998 | |
Quantity | Value | Units | Method | Reference | Comment |
Gas basicity | 779.8 | kJ/mol | N/A | Hunter and Lias, 1998 |

Kovats' RI, non-polar column, isothermal

Column type | Active phase | Temperature (C) | I | Reference | Comment |
---|---|---|---|---|---|
Packed | Apiezon L | 170. | 1780. | Kríz, Popl, et al., 1974 | |
Packed | Apiezon L | 185. | 1793. | Kríz, Popl, et al., 1974 |

Kovats' RI, polar column, isothermal

Column type | Active phase | Temperature (C) | I | Reference | Comment |
---|---|---|---|---|---|
Capillary | SP-1000 | 185. | 2398. | Kríz, Popl, et al., 1974 | N2; Column length: 50. m; Column diameter: 0.25 mm |
Capillary | SP-1000 | 200. | 2355. | Kríz, Popl, et al., 1974 | N2; Column length: 50. m; Column diameter: 0.25 mm |

Van Den Dool and Kratz RI, non-polar column, temperature ramp

Column type | Active phase | I | Reference | Comment |
---|---|---|---|---|
Capillary | SE-54 | 1742.9 | Shapi and Hesso, 1990 | 25. m/0.32 mm/0.15 μm, He, 40. C @ 1. min, 5. K/min, 280. C @ 15. min |

Normal alkane RI, non-polar column, custom temperature program

Column type | Active phase | I | Reference | Comment |
---|---|---|---|---|
Capillary | DB-1 | 1756. | Hathcock and Bertsch, 1993 | 100. m/0.25 mm/0.5 μm; Program: not specified |

References

Coops, Hoijtink, et al., 1953
Coops, J.; Hoijtink, G.J.; Kramer, TH.J.E.,
Thermochemical investigations on arylethanes. II. Heats of combustion of some para and ortho tolylthanes and phenylbutanes.,
Rec. Trav. Chim. Pays/Bas, 1953, 72, 793. [all data]
Cox and Pilcher, 1970
Cox, J.D.; Pilcher, G.,
Thermochemistry of Organic and Organometallic Compounds, Academic Press, New York, 1970, 1-636. [all data]
Serijan and Wise, 1952
Serijan, K.T.; Wise, P.H.,
Dicyclic hydrocarbons. V. Synthesis and physical properties of the diphenyl- and dicyclohexylbutanes,
J. Am. Chem. Soc., 1952, 74, 365-368. [all data]
Wise, Serijan, et al., 1951
Wise, C.H.; Serijan, K.T.; Goodman, I.A.,
NACA Technical Report 1003,
NACA Technical Report 1003, 1951, 1-10. [all data]
Weast and Grasselli, 1989
CRC Handbook of Data on Organic Compounds, 2nd Editon, Weast,R.C and Grasselli, J.G., ed(s)., CRC Press, Inc., Boca Raton, FL, 1989, 1. [all data]
Serijan and Wise, 1952, 2
Serijan, K.T.; Wise, P.H.,
Dicyclic hydrocarbons. V. Synthesis and physical properties of the diphenyl - and dicyclohexylbutanes,
J. Am. Chem. Soc., 1952, 74, 365-8. [all data]
Williams, 1942
Williams, R.B.,
Heats of catalytic hydrogenation in solution. I. Apparatus, technique, and the heats of hydrogenation of certain pairs of stereoisomers,
J. Am. Chem. Soc., 1942, 64, 1395-1404. [all data]
Davis, Allinger, et al., 1985
Davis, H.E.; Allinger, N.L.; Rogers, D.W.,
Enthalpies of hydrogenation of phenylalkynes: indirect determination of the enthalpy of formation of diphenylcyclopropenone,
J. Org. Chem., 1985, 50, 3601-3604. [all data]
Hunter and Lias, 1998
Hunter, E.P.; Lias, S.G.,
Evaluated Gas Phase Basicities and Proton Affinities of Molecules: An Update,
J. Phys. Chem. Ref. Data, 1998, 27, 3, 413-656, https://doi.org/10.1063/1.556018
. [all data]
Kríz, Popl, et al., 1974
Kríz, J.; Popl, M.; Mostecký, J.,
Retention indices of biphenyls and diphenylalkanes,
J. Chromatogr., 1974, 97, 1, 3-13, https://doi.org/10.1016/S0021-9673(01)97577-6
. [all data]
Shapi and Hesso, 1990
Shapi, M.M.; Hesso, A.,
Thermal decomposition of polystyrene volatile compounds from large-scale pyrolysis,
J. Anal. Appl. Pyrolysis, 1990, 18, 2, 143-161, https://doi.org/10.1016/0165-2370(90)80004-8
. [all data]
Hathcock and Bertsch, 1993
Hathcock, S.; Bertsch, W.,
Analysis of volatiles associated with industrial scale processing of expanded polystyrene. Part II: Identification and quantitation,
J. Hi. Res. Chromatogr., 1993, 16, 11, 651-659, https://doi.org/10.1002/jhrc.1240161106
. [all data]