β-Phenylpropiophenone
- Formula: C15H14O
- Molecular weight: 210.2711
- IUPAC Standard InChIKey: QGGZBXOADPVUPN-UHFFFAOYSA-N
- CAS Registry Number: 1083-30-3
- Chemical structure:
View 3d structure (requires JavaScript / HTML 5) - Other names: ω-Benzyl acetophenone; Benzylacetophenone; Dihydrochalcone; Hydrochalcone; Hydrocinnamophenone; Phenethyl phenyl ketone; Phenyl phenethyl ketone; Propiophenone, 3-phenyl-; 1-Propanone, 1,3-diphenyl-; 1,3-Diphenyl-1-oxopropane; 1,3-Diphenyl-1-propanone; 1,3-Diphenyl-3-propanone; 2-Phenethyl phenyl ketone; 3-Phenylpropiophenone; NSC 12245

Reaction thermochemistry data

Data compiled by: Hussein Y. Afeefy, Joel F. Liebman, and Stephen E. Stein
Individual Reactions
By formula: H2 + C15H12O = C15H14O
Quantity | Value | Units | Method | Reference | Comment |
---|---|---|---|---|---|
ΔrH° | -391. | kJ/mol | Chyd | Veselova and Sul'man, 1980 | liquid phase |

Van Den Dool and Kratz RI, non-polar column, temperature ramp

Column type | Active phase | I | Reference | Comment |
---|---|---|---|---|
Capillary | SE-54 | 1834.4 | Shapi and Hesso, 1990 | 25. m/0.32 mm/0.15 μm, He, 40. C @ 1. min, 5. K/min, 280. C @ 15. min |
Capillary | SE-54 | 1834.4 | Shapi and Hesso, 1990 | 25. m/0.32 mm/0.15 μm, He, 40. C @ 1. min, 5. K/min, 280. C @ 15. min |

References

Veselova and Sul'man, 1980
Veselova, M.E.; Sul'man, E.M.,
Effect of the chemical structure of α,β-unsaturated esters and ketones on the selectivity of their hydrogenation,
Svoistva Veshchestv i Stroenie Molekul, Kalinin, 1980, 140-143. [all data]
Shapi and Hesso, 1990
Shapi, M.M.; Hesso, A.,
Thermal decomposition of polystyrene volatile compounds from large-scale pyrolysis,
J. Anal. Appl. Pyrolysis, 1990, 18, 2, 143-161, https://doi.org/10.1016/0165-2370(90)80004-8
. [all data]