Succinic anhydride
- Formula: C4H4O3
- Molecular weight: 100.0728
- IUPAC Standard InChIKey: RINCXYDBBGOEEQ-UHFFFAOYSA-N
- CAS Registry Number: 108-30-5
- Chemical structure:
View 3d structure (requires JavaScript / HTML 5) - Other names: 2,5-Furandione, dihydro-; Butanedioic anhydride; Dihydro-2,5-furandione; Succinic acid anhydride; Succinyl anhydride; Succinyl oxide; Tetrahydro-2,5-dioxofuran; 2,5-Diketotetrahydrofuran; Bernsteinsaure-anhydrid; NCI-C55696; 2,5(3H,4H)-Furandione; 2,5-Dioxotetrahydrofuran; Dihydro-2,5-diketotetrahydrofuran; NSC 8518; Rikacid SA; Tetrahydro-2,5-furandione

Gas phase thermochemistry data

Data compiled by: Hussein Y. Afeefy, Joel F. Liebman, and Stephen E. Stein
Quantity | Value | Units | Method | Reference | Comment |
---|---|---|---|---|---|
ΔfH°gas | -527.9 ± 1.7 | kJ/mol | Ccb | Yan and Pilcher, 1990 |

Condensed phase thermochemistry data

Data compiled by: Hussein Y. Afeefy, Joel F. Liebman, and Stephen E. Stein
Quantity | Value | Units | Method | Reference | Comment |
---|---|---|---|---|---|
ΔfH°solid | -608.6 ± 0.7 | kJ/mol | Ccb | Yan and Pilcher, 1990 | |
Quantity | Value | Units | Method | Reference | Comment |
ΔcH°solid | -1537.1 ± 0.4 | kJ/mol | Ccb | Yan and Pilcher, 1990 | Corresponding ΔfHºsolid = -608.6 kJ/mol (simple calculation by NIST; no Washburn corrections) |
ΔcH°solid | -1543.9 ± 0.63 | kJ/mol | Ccb | Verkade and Hartman, 1933 | Reanalyzed by Cox and Pilcher, 1970, Original value = -1548.9 kJ/mol; Corresponding ΔfHºsolid = -601.78 kJ/mol (simple calculation by NIST; no Washburn corrections) |

Phase change data

Data compiled as indicated in comments:
BS - Robert L. Brown and Stephen E. Stein
TRC - Thermodynamics Research Center, NIST Boulder Laboratories, Chris Muzny director
AC - William E. Acree, Jr., James S. Chickos
ALS - Hussein Y. Afeefy, Joel F. Liebman, and Stephen E. Stein
DRB - Donald R. Burgess, Jr.
Quantity | Value | Units | Method | Reference | Comment |
---|---|---|---|---|---|
Tboil | 534.2 | K | N/A | Weast and Grasselli, 1989 | BS |
Quantity | Value | Units | Method | Reference | Comment |
Tfus | 392.6 | K | N/A | Mclean and Adams, 1936 | Uncertainty assigned by TRC = 1. K; TRC |
Tfus | 393.15 | K | N/A | Berner, 1929 | Uncertainty assigned by TRC = 1.5 K; TRC |
Tfus | 392. | K | N/A | Tammann, 1913 | Uncertainty assigned by TRC = 1. K; TRC |
Quantity | Value | Units | Method | Reference | Comment |
ΔsubH° | 80.7 ± 1.6 | kJ/mol | C | Meng-Yan and Pilcher, 1990 | AC |
ΔsubH° | 80.7 ± 1.6 | kJ/mol | V | Yan and Pilcher, 1990 | ALS |
ΔsubH° | 80.7 | kJ/mol | N/A | Yan and Pilcher, 1990 | DRB |
Enthalpy of vaporization
ΔvapH (kJ/mol) | Temperature (K) | Method | Reference | Comment |
---|---|---|---|---|
57.3 | 416. | A | Stephenson and Malanowski, 1987 | Based on data from 401. to 534. K.; AC |
Antoine Equation Parameters
log10(P) = A − (B / (T + C))
P = vapor pressure (bar)
T = temperature (K)
View plot Requires a JavaScript / HTML 5 canvas capable browser.
Temperature (K) | A | B | C | Reference | Comment |
---|---|---|---|---|---|
365. to 534. | 3.65221 | 1433.874 | -144.107 | Stull, 1947 | Coefficents calculated by NIST from author's data. |
Enthalpy of sublimation
ΔsubH (kJ/mol) | Temperature (K) | Method | Reference | Comment |
---|---|---|---|---|
80.5 ± 1.6 | 309. | ME | Meng-Yan and Pilcher, 1990 | Based on data from 298. to 320. K.; AC |
82.2 | 302. | ME,TE | De Wit, Van Miltenburg, et al., 1983 | Based on data from 290. to 311. K.; AC |

Reaction thermochemistry data

Data compiled by: Hussein Y. Afeefy, Joel F. Liebman, and Stephen E. Stein
Individual Reactions
By formula: C4H4O3 + H2O = C4H6O4
Quantity | Value | Units | Method | Reference | Comment |
---|---|---|---|---|---|
ΔrH° | -46.86 ± 0.08 | kJ/mol | Cm | Conn, Kistiakowsky, et al., 1942 | liquid phase; Heat of hydrolysis at 303 K |

Gas phase ion energetics data

Data compiled by: Sharon G. Lias, Rhoda D. Levin, and Sherif A. Kafafi
Ionization energy determinations
IE (eV) | Method | Reference | Comment |
---|---|---|---|
10.84 | PE | Kimura, Katsumata, et al., 1981 | Vertical value |
10.84 | PE | Worley, Gerson, et al., 1978 | Vertical value |
10.84 | PE | Gerson, Worley, et al., 1978 | Vertical value |
10.8 | PE | Almemark, Backvall, et al., 1974 | Vertical value |

References

Yan and Pilcher, 1990
Yan, Y.M.; Pilcher, G.,
Enthalpies of combustion of succinic anhydride, glutaric anhydride, and glutarimide,
J. Chem. Thermodyn., 1990, 22, 893-898. [all data]
Verkade and Hartman, 1933
Verkade, P.E.; Hartman, H.,
Calorimetric researches XXI. Heats of combustion of methyl-, ethyl- and phenyl-substituted succinic acids and of their anhydrides: a. Experimental data,
Rec. Trav. Chim. Pays/Bas, 1933, 52, 945-968. [all data]
Cox and Pilcher, 1970
Cox, J.D.; Pilcher, G.,
Thermochemistry of Organic and Organometallic Compounds, Academic Press, New York, 1970, 1-636. [all data]
Weast and Grasselli, 1989
CRC Handbook of Data on Organic Compounds, 2nd Editon, Weast,R.C and Grasselli, J.G., ed(s)., CRC Press, Inc., Boca Raton, FL, 1989, 1. [all data]
Mclean and Adams, 1936
Mclean, A.; Adams, R.,
Succinic-α-d2,;alpha.'-d2, Acid and Its Derivatives,
J. Am. Chem. Soc., 1936, 58, 804-10. [all data]
Berner, 1929
Berner, E.,
The refraction constants and volume of solution of some organic compounds in aqueous solution,
Z. Phys. Chem., Abt. A, 1929, 141, 91. [all data]
Tammann, 1913
Tammann, G.,
Nachr. Ges. Wiss. Goettingen, Math.-Phys. Kl., 1913, 1913, 335. [all data]
Meng-Yan and Pilcher, 1990
Meng-Yan, Yang; Pilcher, G.,
Enthalpies of combustion of succinic anhydride, glutaric anhydride, and glutarimide,
The Journal of Chemical Thermodynamics, 1990, 22, 9, 893-898, https://doi.org/10.1016/0021-9614(90)90177-R
. [all data]
Stephenson and Malanowski, 1987
Stephenson, Richard M.; Malanowski, Stanislaw,
Handbook of the Thermodynamics of Organic Compounds, 1987, https://doi.org/10.1007/978-94-009-3173-2
. [all data]
Stull, 1947
Stull, Daniel R.,
Vapor Pressure of Pure Substances. Organic and Inorganic Compounds,
Ind. Eng. Chem., 1947, 39, 4, 517-540, https://doi.org/10.1021/ie50448a022
. [all data]
De Wit, Van Miltenburg, et al., 1983
De Wit, H.G.M.; Van Miltenburg, J.C.; De Kruif, C.G.,
Thermodynamic properties of molecular organic crystals containing nitrogen, oxygen, and sulphur 1. Vapour pressures and enthalpies of sublimation,
The Journal of Chemical Thermodynamics, 1983, 15, 7, 651-663, https://doi.org/10.1016/0021-9614(83)90079-4
. [all data]
Conn, Kistiakowsky, et al., 1942
Conn, J.B.; Kistiakowsky, G.B.; Roberts, R.M.; Smith, E.A.,
Heats of organic reactions. XIII. Heats of hydrolysis of some acid anhydrides,
J. Am. Chem. Soc., 1942, 64, 1747-17. [all data]