1-Propen-2-ol, acetate
- Formula: C5H8O2
- Molecular weight: 100.1158
- IUPAC Standard InChIKey: HETCEOQFVDFGSY-UHFFFAOYSA-N
- CAS Registry Number: 108-22-5
- Chemical structure:
View 3d structure (requires JavaScript / HTML 5) - Other names: Isopropenyl acetate; Propen-2-yl acetate; 2-Acetoxypropene; 2-Acetoxypropylene; Acetic acid 1-methylethenyl ester; Acetic acid isopropenyl ester; Methylvinyl acetate; 1-Acetoxy-1-methylethylene; 1-Methylvinyl acetate; 1-Propen-2-yl acetate; UN 2403; 1-Propen-2-ol, 2-acetate; NSC 2197

Phase change data

Data compiled as indicated in comments:
BS - Robert L. Brown and Stephen E. Stein
TRC - Thermodynamics Research Center, NIST Boulder Laboratories, Chris Muzny director
Quantity | Value | Units | Method | Reference | Comment |
---|---|---|---|---|---|
Tboil | 367.2 | K | N/A | Aldrich Chemical Company Inc., 1990 | BS |
Tboil | 370. | K | N/A | American Tokyo Kasei, 1988 | BS |
Tboil | 370. | K | N/A | Gaylord and Eirich, 1952 | Uncertainty assigned by TRC = 2. K; TRC |

Reaction thermochemistry data

Data compiled by: Hussein Y. Afeefy, Joel F. Liebman, and Stephen E. Stein
Individual Reactions
By formula: C2H4O2 + C3H6O = C5H8O2 + H2O
Quantity | Value | Units | Method | Reference | Comment |
---|---|---|---|---|---|
ΔrH° | 60.2 ± 0.3 | kJ/mol | Cm | Sunner, 1957 | liquid phase; Heat of hydrolysis |

Kovats' RI, non-polar column, isothermal

Column type | Active phase | Temperature (C) | I | Reference | Comment |
---|---|---|---|---|---|
Packed | Apiezon L | 120. | 608. | Bogoslovsky, Anvaer, et al., 1978 | Celite 545 |
Packed | Apiezon L | 160. | 609. | Bogoslovsky, Anvaer, et al., 1978 | Celite 545 |
Packed | SE-30 | 150. | 641. | Allen and Haken, 1970 | Celite 560 silanized; Column length: 3.7 m |
Packed | SE-30 | 150. | 644. | Germaine and Haken, 1969 | Celite 560; Column length: 3.7 m |

Normal alkane RI, non-polar column, temperature ramp

Column type | Active phase | I | Reference | Comment |
---|---|---|---|---|
Capillary | OV-101 | 673. | Zenkevich, 2005 | 25. m/0.20 mm/0.10 μm, N2/He, 6. K/min; Tstart: 50. C; Tend: 250. C |

Condensed phase thermochemistry data

Data compiled by: Hussein Y. Afeefy, Joel F. Liebman, and Stephen E. Stein
Quantity | Value | Units | Method | Reference | Comment |
---|---|---|---|---|---|
ΔfH°liquid | -386.2 ± 0.96 | kJ/mol | Cm | Sunner, 1957 | Heat of formation derived by Cox and Pilcher, 1970 |

References

Aldrich Chemical Company Inc., 1990
Aldrich Chemical Company Inc.,
Catalog Handbook of Fine Chemicals, Aldrich Chemical Company, Inc., Milwaukee WI, 1990, 1. [all data]
American Tokyo Kasei, 1988
American Tokyo Kasei,
TCI American Organic Chemical 88/89 Catalog, American Tokyo Kasei, Portland, OR, 1988, 1610. [all data]
Gaylord and Eirich, 1952
Gaylord, N.G.; Eirich, F.R.,
Allyl Polymerization. II. Decomposition of Bwenoyl Peroxide in Allyl Esters,
J. Am. Chem. Soc., 1952, 74, 334-7. [all data]
Sunner, 1957
Sunner, S.,
The heat of hydrolysis of i-propenyl acetate and m-cresyl acetate and the heat of formation of acetone,
Acta Chem. Scand., 1957, 11, 1757-1760. [all data]
Bogoslovsky, Anvaer, et al., 1978
Bogoslovsky, Yu.N.; Anvaer, B.I.; Vigdergauz, M.S.,
Chromatographic constants in gas chromatography (in Russian), Standards Publ. House, Moscow, 1978, 192. [all data]
Allen and Haken, 1970
Allen, I.D.; Haken, J.K.,
Gas chromatography of homologous esters. Part IV. Influence of stationary phase polarity on retention of unsaturated esters,
J. Chromatogr., 1970, 51, 415-422, https://doi.org/10.1016/S0021-9673(01)96890-6
. [all data]
Germaine and Haken, 1969
Germaine, R.W.; Haken, J.K.,
Gas chromatography of homologous esters. Part 2. Unsaturated esters,
J. Chromatogr., 1969, 43, 43-47, https://doi.org/10.1016/S0021-9673(00)99163-5
. [all data]
Zenkevich, 2005
Zenkevich, I.G.,
Experimentally measured retention indices., 2005. [all data]