Imidodicarbonic diamide
- Formula: C2H5N3O2
- Molecular weight: 103.0800
- IUPAC Standard InChIKey: OHJMTUPIZMNBFR-UHFFFAOYSA-N
- CAS Registry Number: 108-19-0
- Chemical structure:
View 3d structure (requires JavaScript / HTML 5) - Other names: Allophanamide; Allophanic acid amide; Allophanimidic acid; Biuret; Carbamylurea; Dicarbamylamine; Isobiuret; Urea, (aminocarbonyl)-; Ureidoformamide; L-101; NSC 8020

Gas phase thermochemistry data

Data compiled by: Hussein Y. Afeefy, Joel F. Liebman, and Stephen E. Stein
Quantity | Value | Units | Method | Reference | Comment |
---|---|---|---|---|---|
ΔfH°gas | -437.0 ± 2.8 | kJ/mol | Ccb | Kozyro, Frenkel, et al., 1988 |

Condensed phase thermochemistry data

Data compiled as indicated in comments:
ALS - Hussein Y. Afeefy, Joel F. Liebman, and Stephen E. Stein
DH - Eugene S. Domalski and Elizabeth D. Hearing
Quantity | Value | Units | Method | Reference | Comment |
---|---|---|---|---|---|
ΔfH°solid | -563.7 ± 2.1 | kJ/mol | Ccb | Kozyro, Frenkel, et al., 1988 | ALS |
Quantity | Value | Units | Method | Reference | Comment |
ΔcH°solid | -938.0 ± 2.1 | kJ/mol | Ccb | Kozyro, Frenkel, et al., 1988 | ALS |
Quantity | Value | Units | Method | Reference | Comment |
S°solid,1 bar | 146.1 | J/mol*K | N/A | Luff and Reed, 1982 | DH |
S°solid,1 bar | 146.1 | J/mol*K | N/A | Kozyro, Frenkel', et al., 1988 | DH |
Constant pressure heat capacity of solid
Cp,solid (J/mol*K) | Temperature (K) | Reference | Comment |
---|---|---|---|
131.3 | 298.15 | Kozyro, Frenkel', et al., 1988 | T = 240 to 450 K.; DH |
131.3 | 298.15 | Luff and Reed, 1982 | T = 5 to 320 K.; DH |

Phase change data

Data compiled as indicated in comments:
ALS - Hussein Y. Afeefy, Joel F. Liebman, and Stephen E. Stein
DH - Eugene S. Domalski and Elizabeth D. Hearing
Quantity | Value | Units | Method | Reference | Comment |
---|---|---|---|---|---|
ΔsubH° | 126.7 ± 1.9 | kJ/mol | V | Kozyro, Frenkel, et al., 1988 | ALS |
Enthalpy of phase transition
ΔHtrs (kJ/mol) | Temperature (K) | Initial Phase | Final Phase | Reference | Comment |
---|---|---|---|---|---|
0.970 | 372. | crystaline, II | crystaline, I | Kozyro, Frenkel', et al., 1988 | DH |
Entropy of phase transition
ΔStrs (J/mol*K) | Temperature (K) | Initial Phase | Final Phase | Reference | Comment |
---|---|---|---|---|---|
2.54 | 372. | crystaline, II | crystaline, I | Kozyro, Frenkel', et al., 1988 | DH |

References

Kozyro, Frenkel, et al., 1988
Kozyro, A.A.; Frenkel, M.L.; Krasulin, A.P.; Simirskii, V.V.; Kabo, G.Ya.,
Thermodynamic properties of biuret in different states of aggregation,
Russ. J. Phys. Chem. (Engl. Transl.), 1988, 62, 897-899. [all data]
Luff and Reed, 1982
Luff, B.B.; Reed, R.B.,
Low-temperature heat capacity and entropy of oxalic acid and of biuret,
J. Chem. Eng. Data, 1982, 27, 290-292. [all data]
Kozyro, Frenkel', et al., 1988
Kozyro, A.A.; Frenkel', M.L.; Krasulin, A.P.; Simirskii, V.V.; Kabo, G.Ya.,
Thermodynamic properties of biuret in different states of aggregation,
Zhur. Fiz. Khim., 1988, 62, 1752-1756. [all data]