N-(p-Methoxyphenyl)maleimide
- Formula: C11H9NO3
- Molecular weight: 203.1941
- IUPAC Standard InChIKey: XAHCEMQKWSQGLQ-UHFFFAOYSA-N
- CAS Registry Number: 1081-17-0
- Chemical structure:
View 3d structure (requires JavaScript / HTML 5) - Other names: N-(4-Methoxyphenyl)maleimide

Phase change data

Data compiled by: William E. Acree, Jr., James S. Chickos
Enthalpy of sublimation
ΔsubH (kJ/mol) | Temperature (K) | Method | Reference |
---|---|---|---|
121.1 ± 0.8 | 350. to 370. | C | Kiselev, Kashaeva, et al., 1998 |

Reaction thermochemistry data

Data compiled by: Hussein Y. Afeefy, Joel F. Liebman, and Stephen E. Stein
Individual Reactions
+
= C31H23NO4
By formula: C11H9NO3 + C20H14O = C31H23NO4
Quantity | Value | Units | Method | Reference | Comment |
---|---|---|---|---|---|
ΔrH° | -99.1 ± 0.4 | kJ/mol | Cm | Kiselev, Ustyugov, et al., 1977 | liquid phase; solvent: Dioxane |

References

Kiselev, Kashaeva, et al., 1998
Kiselev, V.D.; Kashaeva, E.A.; Konovalov, A.I.,
Enthalpies of sublimation, solution, and solvation of N-arylmaleimides,
Russ. J. Gen. Chem., 1998, 68, 8, 1246. [all data]
Kiselev, Ustyugov, et al., 1977
Kiselev, V.D.; Ustyugov, A.N.; Breus, I.P.; Konovalov, A.I.,
Kinetic and thermochemical study of the Diels-Alder reaction,
Dokl. Phys. Chem. (Engl. Transl.), 1977, 234, 320-322, In original 1089. [all data]