Pentane, 2,4-dimethyl-
- Formula: C7H16
- Molecular weight: 100.2019
- IUPAC Standard InChIKey: BZHMBWZPUJHVEE-UHFFFAOYSA-N
- CAS Registry Number: 108-08-7
- Chemical structure:
View 3d structure (requires JavaScript / HTML 5) - Other names: 2,4-Dimethylpentane

Gas phase thermochemistry data

Data compiled as indicated in comments:
ALS - Hussein Y. Afeefy, Joel F. Liebman, and Stephen E. Stein
DRB - Donald R. Burgess, Jr.
GT - Glushko Thermocenter, Russian Academy of Sciences, Moscow
Quantity | Value | Units | Method | Reference | Comment |
---|---|---|---|---|---|
ΔfH°gas | -48.30 ± 0.23 | kcal/mol | Ccb | Prosen and Rossini, 1945 | ALS |
ΔfH°gas | -49.02 | kcal/mol | N/A | Davies and Gilbert, 1941 | Value computed using ΔfHliquid° value of -238.0±1.0 kj/mol from Davies and Gilbert, 1941 and ΔvapH° value of 32.9 kj/mol from Prosen and Rossini, 1945.; DRB |
Quantity | Value | Units | Method | Reference | Comment |
S°gas | 94.821 | cal/mol*K | N/A | Huffman H.M., 1961 | GT |
Constant pressure heat capacity of gas
Cp,gas (cal/mol*K) | Temperature (K) | Reference | Comment |
---|---|---|---|
27.591 | 200. | Scott D.W., 1974 | Recommended values were obtained from the consistent correlation scheme for alkanes [ Scott D.W., 1974, 2, Scott D.W., 1974]. This approach gives a good agreement with experimental data available for alkanes. However, large uncertainties could be expected at high temperatures.; GT |
37.660 | 273.15 | ||
40.81 ± 0.1 | 298.15 | ||
41.040 | 300. | ||
52.600 | 400. | ||
62.469 | 500. | ||
70.801 | 600. | ||
78.000 | 700. | ||
84.199 | 800. | ||
89.500 | 900. | ||
94.199 | 1000. | ||
98.301 | 1100. | ||
101.90 | 1200. | ||
105.00 | 1300. | ||
108.00 | 1400. | ||
111.00 | 1500. |

Condensed phase thermochemistry data

Data compiled as indicated in comments:
ALS - Hussein Y. Afeefy, Joel F. Liebman, and Stephen E. Stein
DH - Eugene S. Domalski and Elizabeth D. Hearing
Quantity | Value | Units | Method | Reference | Comment |
---|---|---|---|---|---|
ΔfH°liquid | -56.17 ± 0.23 | kcal/mol | Ccb | Prosen and Rossini, 1945 | ALS |
ΔfH°liquid | -57.0 ± 0.3 | kcal/mol | Ccb | Davies and Gilbert, 1941 | ALS |
Quantity | Value | Units | Method | Reference | Comment |
ΔcH°liquid | -1148.73 ± 0.20 | kcal/mol | Ccb | Prosen and Rossini, 1945 | Corresponding ΔfHºliquid = -56.15 kcal/mol (simple calculation by NIST; no Washburn corrections); ALS |
ΔcH°liquid | -1147.8 ± 0.3 | kcal/mol | Ccb | Davies and Gilbert, 1941 | Corresponding ΔfHºliquid = -57.10 kcal/mol (simple calculation by NIST; no Washburn corrections); ALS |
Quantity | Value | Units | Method | Reference | Comment |
S°liquid | 72.459 | cal/mol*K | N/A | Huffman, Gross, et al., 1961 | DH |
S°liquid | 69.69 | cal/mol*K | N/A | Huffman, Parks, et al., 1930 | Extrapolation below 90 K, 65.90 J/mol*K.; DH |
Constant pressure heat capacity of liquid
Cp,liquid (cal/mol*K) | Temperature (K) | Reference | Comment |
---|---|---|---|
53.590 | 298.15 | Huffman, Gross, et al., 1961 | T = 10 to 300 K.; DH |
52.80 | 294.4 | Huffman, Parks, et al., 1930 | T = 92 to 294 K. Value is unsmoothed experimental datum.; DH |

Phase change data

Data compiled as indicated in comments:
BS - Robert L. Brown and Stephen E. Stein
TRC - Thermodynamics Research Center, NIST Boulder Laboratories, Chris Muzny director
AC - William E. Acree, Jr., James S. Chickos
ALS - Hussein Y. Afeefy, Joel F. Liebman, and Stephen E. Stein
DH - Eugene S. Domalski and Elizabeth D. Hearing
Quantity | Value | Units | Method | Reference | Comment |
---|---|---|---|---|---|
Tboil | 353.7 ± 0.3 | K | AVG | N/A | Average of 42 out of 48 values; Individual data points |
Quantity | Value | Units | Method | Reference | Comment |
Tfus | 153. ± 3. | K | AVG | N/A | Average of 27 values; Individual data points |
Quantity | Value | Units | Method | Reference | Comment |
Ttriple | 154. ± 1. | K | AVG | N/A | Average of 7 values; Individual data points |
Quantity | Value | Units | Method | Reference | Comment |
Tc | 519.8 ± 0.5 | K | N/A | Daubert, 1996 | |
Tc | 519.73 | K | N/A | McMicking and Kay, 1965 | Uncertainty assigned by TRC = 0.4 K; TRC |
Tc | 521.7 | K | N/A | Francis, 1957 | Uncertainty assigned by TRC = 2. K; TRC |
Tc | 520.25 | K | N/A | Edgar and Calingaert, 1929 | Uncertainty assigned by TRC = 0.5 K; measured by Keys and Kleinschmidt; TRC |
Quantity | Value | Units | Method | Reference | Comment |
Pc | 27.0 ± 0.5 | atm | N/A | Daubert, 1996 | |
Pc | 27.009 | atm | N/A | McMicking and Kay, 1965 | Uncertainty assigned by TRC = 0.4000 atm; TRC |
Pc | 27.400 | atm | N/A | Edgar and Calingaert, 1929 | Uncertainty assigned by TRC = 0.5000 atm; measured by Keys and Kleinschmidt; TRC |
Quantity | Value | Units | Method | Reference | Comment |
Vc | 0.418 | l/mol | N/A | Daubert, 1996 | |
Quantity | Value | Units | Method | Reference | Comment |
ρc | 2.40 ± 0.05 | mol/l | N/A | Daubert, 1996 | |
ρc | 2.40 | mol/l | N/A | McMicking and Kay, 1965 | Uncertainty assigned by TRC = 0.05 mol/l; TRC |
Quantity | Value | Units | Method | Reference | Comment |
ΔvapH° | 7.892 | kcal/mol | N/A | Majer and Svoboda, 1985 | |
ΔvapH° | 7.82 ± 0.02 | kcal/mol | C | Svoboda, 1998 | AC |
ΔvapH° | 7.86 ± 0.02 | kcal/mol | C | Osborne and Ginnings, 1947 | AC |
ΔvapH° | 7.859 | kcal/mol | C | Osborne and Ginnings, 1947, 2 | ALS |
Enthalpy of vaporization
ΔvapH (kcal/mol) | Temperature (K) | Method | Reference | Comment |
---|---|---|---|---|
7.063 | 353.7 | N/A | Majer and Svoboda, 1985 | |
7.72 ± 0.02 | 308. | C | Svoboda, 1998 | AC |
7.62 ± 0.02 | 315. | C | Svoboda, 1998 | AC |
7.53 ± 0.02 | 323. | C | Svoboda, 1998 | AC |
7.41 ± 0.02 | 330. | C | Svoboda, 1998 | AC |
7.31 ± 0.02 | 338. | C | Svoboda, 1998 | AC |
7.17 ± 0.02 | 348. | C | Svoboda, 1998 | AC |
7.96 | 299. | A | Stephenson and Malanowski, 1987 | Based on data from 284. to 355. K. See also Kkykj and Repas, 1973.; AC |
7.93 | 302. | N/A | Forziati, Norris, et al., 1949 | Based on data from 287. to 354. K.; AC |
Antoine Equation Parameters
log10(P) = A − (B / (T + C))
P = vapor pressure (atm)
T = temperature (K)
View plot Requires a JavaScript / HTML 5 canvas capable browser.
Temperature (K) | A | B | C | Reference | Comment |
---|---|---|---|---|---|
286.86 to 354.52 | 3.9555 | 1197.608 | -50.877 | Forziati, Norris, et al., 1949, 2 | Coefficents calculated by NIST from author's data. |
Enthalpy of fusion
ΔfusH (kcal/mol) | Temperature (K) | Reference | Comment |
---|---|---|---|
1.636 | 153.97 | Huffman, Gross, et al., 1961 | DH |
1.64 | 154. | Domalski and Hearing, 1996 | AC |
1.600 | 152.5 | Huffman, Parks, et al., 1930 | DH |
Entropy of fusion
ΔfusS (cal/mol*K) | Temperature (K) | Reference | Comment |
---|---|---|---|
10.63 | 153.97 | Huffman, Gross, et al., 1961 | DH |
10.49 | 152.5 | Huffman, Parks, et al., 1930 | DH |

Reaction thermochemistry data

Data compiled by: Hussein Y. Afeefy, Joel F. Liebman, and Stephen E. Stein
Individual Reactions
By formula: H2 + C7H14 = C7H16
Quantity | Value | Units | Method | Reference | Comment |
---|---|---|---|---|---|
ΔrH° | -27.39 ± 0.29 | kcal/mol | Chyd | Rogers and Dejroongruang, 1989 | liquid phase; solvent: Cyclohexane |
ΔrH° | -26.7 | kcal/mol | Chyd | Turner, Nettleton, et al., 1958 | liquid phase; solvent: Acetic acid |
By formula: H2 + C7H14 = C7H16
Quantity | Value | Units | Method | Reference | Comment |
---|---|---|---|---|---|
ΔrH° | -26.15 ± 0.29 | kcal/mol | Chyd | Rogers and Dejroongruang, 1989 | liquid phase; solvent: Cyclohexane |
ΔrH° | -25.2 | kcal/mol | Chyd | Turner, Nettleton, et al., 1958 | liquid phase; solvent: Acetic acid |
By formula: C7H16 = C7H16
Quantity | Value | Units | Method | Reference | Comment |
---|---|---|---|---|---|
ΔrH° | -2.54 ± 0.16 | kcal/mol | Ccb | Prosen and Rossini, 1941 | liquid phase; Heat of Isomerization |
ΔrH° | -3.40 ± 0.22 | kcal/mol | Ccb | Prosen and Rossini, 1941 | gas phase; Heat of Isomerization |

Henry's Law data

Data compiled by: Rolf Sander
Henry's Law constant (water solution)
kH(T) = k°H exp(d(ln(kH))/d(1/T) ((1/T) - 1/(298.15 K)))
k°H = Henry's law constant for solubility in water at 298.15 K (mol/(kg*bar))
d(ln(kH))/d(1/T) = Temperature dependence constant (K)
k°H (mol/(kg*bar)) | d(ln(kH))/d(1/T) (K) | Method | Reference | Comment |
---|---|---|---|---|
0.00034 | Q | N/A | missing citation give several references for the Henry's law constants but don't assign them to specific species. | |
0.00034 | L | N/A | ||
0.00032 | V | N/A |

Kovats' RI, non-polar column, isothermal

View large format table.

Column type Active phase Temperature (C) I Reference Comment
PackedC78, Branched paraffin130.628.9Dallos, Sisak, et al., 2000He; Column length: 3.3 m
CapillarySqualane100.630.Heinzen, Soares, et al., 1999
CapillaryOV-1010.628.Skrbic, 1997
CapillaryOV-1010.628.Skrbic, 1997
PackedSqualane78.5632.0Zhang and Lu, 1996
CapillaryCP Sil 260.626.3Estel, Mohnke, et al., 1995100. m/0.25 mm/0.25 μm
CapillaryOV-101150.630.3Cha and Lee, 1994Column length: 20. m; Column diameter: 0.5 mm
CapillaryOV-101180.634.9Cha and Lee, 1994Column length: 20. m; Column diameter: 0.5 mm
CapillaryDB-160.631.0Krupcik, Skacani, et al., 1994H2; Phase thickness: 0.25 μm
CapillaryPONA60.630.8Krupcik, Skacani, et al., 1994H2; Phase thickness: 0.5 μm
CapillaryPONA60.631.0Krupcik, Skacani, et al., 1994H2; Phase thickness: 0.5 μm
CapillaryDB-160.630.9Krupcik, Skacani, et al., 1994H2; Phase thickness: 1. μm
CapillaryOV-10160.630.7Krupcik, Skacani, et al., 1994H2; Phase thickness: 0.2 μm
PackedC78, Branched paraffin130.629.3Reddy, Dutoit, et al., 1992Chromosorb G HP; Column length: 3.3 m
CapillaryBP-10.628.Skrbic and Cvejanov, 199215. m/0.53 mm/1.0 μm, N2
PackedApolane130.630.Dutoit, 1991Column length: 3.7 m
CapillaryMethyl Silicone40.630.Takeda, 1991Column length: 50. m; Column diameter: 0.20 mm
CapillaryMethyl Silicone80.631.Takeda, 1991Column length: 50. m; Column diameter: 0.20 mm
CapillaryOV-145.630.4Guan, Kiraly, et al., 198920. m/0.32 mm/1.2 μm, He
CapillaryOV-145.630.5Guan, Kiraly, et al., 198925. m/0.31 mm/0.52 μm, He
CapillaryOV-165.631.3Guan, Kiraly, et al., 198925. m/0.31 mm/0.52 μm, He
CapillarySqualane50.629.8Guan, Kiraly, et al., 198950. m/0.22 mm/0.21 μm, He
CapillarySqualane70.630.5Guan, Kiraly, et al., 198950. m/0.22 mm/0.21 μm, He
CapillarySE-5445.629.3Guan, Kiraly, et al., 198925. m/0.31 mm/0.52 μm, He
CapillarySE-5465.629.8Guan, Kiraly, et al., 198925. m/0.31 mm/0.52 μm, He
CapillaryOV-10140.631.Laub and Purnell, 1988
CapillaryOV-10160.632.Laub and Purnell, 1988
CapillaryOV-10180.633.Laub and Purnell, 1988
CapillarySqualane50.630.Lunskii and Paizanskaya, 1988He; Column length: 50. m; Column diameter: 0.22 mm
CapillarySqualane70.630.2Lunskii and Paizanskaya, 1988He; Column length: 50. m; Column diameter: 0.22 mm
CapillaryOV-10140.629.9Boneva and Dimov, 1986100. m/0.27 mm/0.9 μm
CapillaryOV-10150.630.4Boneva and Dimov, 1986100. m/0.27 mm/0.9 μm
CapillaryOV-10160.630.9Boneva and Dimov, 1986100. m/0.27 mm/0.9 μm
CapillaryOV-10170.631.5Boneva and Dimov, 1986100. m/0.27 mm/0.9 μm
CapillaryOV-10130.631.Chien, Furio, et al., 1983
CapillaryOV-10140.631.Chien, Furio, et al., 1983
CapillaryOV-10150.632.Chien, Furio, et al., 1983
CapillaryOV-10160.632.Chien, Furio, et al., 1983
CapillaryOV-10170.632.Chien, Furio, et al., 1983
CapillaryOV-10180.633.Chien, Furio, et al., 1983
CapillaryOV-330.628.7Chien, Furio, et al., 1983, 2
CapillaryOV-340.629.0Chien, Furio, et al., 1983, 2
CapillaryOV-350.629.3Chien, Furio, et al., 1983, 2
CapillaryOV-360.629.6Chien, Furio, et al., 1983, 2
CapillaryOV-370.630.0Chien, Furio, et al., 1983, 2
CapillaryOV-380.630.3Chien, Furio, et al., 1983, 2
CapillaryDB-160.631.Lubeck and Sutton, 1983Column length: 60. m; Column diameter: 0.264 mm
CapillaryDB-160.630.9Lubeck and Sutton, 198360. m/0.259 mm/1. μm
CapillaryOV-150.630.Anders, Scheller, et al., 1982Column length: 55. m; Column diameter: 0.21 mm
CapillaryOV-10150.630.Johansen and Ettre, 1982100. m/0.27 mm/0.20 μm
CapillaryOV-10150.630.Johansen and Ettre, 198255. m/0.27 mm/0.9 μm
CapillaryOV-150.632.Johansen and Ettre, 198217.5 m/0.2 mm/0.15 μm
CapillarySE-3050.632.Johansen and Ettre, 198217.5 m/0.2 mm/0.15 μm
CapillarySF-9650.630.Johansen and Ettre, 198291.4 m/0.31 mm/0.20 μm
CapillaryOV-130.630.5Chien, Kopecni, et al., 1981H2
CapillaryOV-140.631.2Chien, Kopecni, et al., 1981H2
CapillaryOV-150.631.9Chien, Kopecni, et al., 1981H2
CapillaryOV-160.632.6Chien, Kopecni, et al., 1981H2
CapillaryOV-170.633.4Chien, Kopecni, et al., 1981H2
CapillaryOV-180.634.2Chien, Kopecni, et al., 1981H2
CapillarySE-3030.633.7Chien, Kopecni, et al., 1981H2
CapillarySE-3040.633.1Chien, Kopecni, et al., 1981H2
CapillarySE-3050.632.2Chien, Kopecni, et al., 1981H2
CapillarySE-3060.631.5Chien, Kopecni, et al., 1981H2
CapillarySE-3070.630.6Chien, Kopecni, et al., 1981H2
CapillarySE-3080.629.6Chien, Kopecni, et al., 1981H2
CapillaryOV-160.627.Nijs and Jacobs, 1981He; Column length: 150. m; Column diameter: 0.50 mm
PackedSqualane100.631.Nabivach and Kirilenko, 1980He, Chromaton N-AW-HMDS; Column length: 1. m
PackedTriacontane70.629.Castello and D'Amato, 1979He, Chromosorb W AW (60-80 mesh); Column length: 3. m
PackedTriacontane80.629.Castello and D'Amato, 1979He, Chromosorb W AW (60-80 mesh); Column length: 3. m
PackedSqualane70.632.Castello and D'Amato, 1979He, Chromosorb W AW (60-80 mesh); Column length: 3. m
PackedSqualane80.631.Castello and D'Amato, 1979He, Chromosorb W AW (60-80 mesh); Column length: 3. m
PackedOV-180.632.Dimov and Papazova, 1979Chromosorb W AW DMCS (80-100 mesh); Column length: 4. m
PackedSE-3080.632.Dimov and Papazova, 1979Chromosorb W AW DMCS (80-100 mesh); Column length: 4. m
CapillarySqualane60.630.Chretien and Dubois, 1976
CapillarySqualane100.631.Lulova, Leont'eva, et al., 1976He; Column length: 120. m; Column diameter: 0.25 mm
CapillarySqualane100.631.Lulova, Leont'eva, et al., 1976He; Column length: 120. m; Column diameter: 0.25 mm
PackedApolane70.626.9Riedo, Fritz, et al., 1976He, Chromosorb; Column length: 2.4 m
CapillarySqualane50.630.Rijks and Cramers, 1974N2; Column length: 100. m; Column diameter: 0.25 mm
CapillarySqualane70.630.Rijks and Cramers, 1974N2; Column length: 100. m; Column diameter: 0.25 mm
PackedSF-96100.633.19Castello, Berg, et al., 1973Chromosorb P(DMCS); Column length: 4. m
PackedSF-96110.633.65Castello, Berg, et al., 1973Chromosorb P(DMCS); Column length: 4. m
PackedSF-96120.633.57Castello, Berg, et al., 1973Chromosorb P(DMCS); Column length: 4. m
PackedSF-9680.632.42Castello, Berg, et al., 1973Chromosorb P(DMCS); Column length: 4. m
PackedSF-9690.632.98Castello, Berg, et al., 1973Chromosorb P(DMCS); Column length: 4. m
CapillaryOV-10150.631.Pacáková, Hoch, et al., 197325. m/0.25 mm/1.39 μm, N2
CapillaryOV-10160.631.Pacáková, Hoch, et al., 197325. m/0.25 mm/1.39 μm, N2
CapillaryVacuum Grease Oil (VM-4)35.626.Sidorov, Petrova, et al., 1972
CapillaryVacuum Grease Oil (VM-4)45.627.Sidorov, Petrova, et al., 1972
CapillaryVacuum Grease Oil (VM-4)50.627.Sidorov, Petrova, et al., 1972
CapillaryVacuum Grease Oil (VM-4)58.628.Sidorov, Petrova, et al., 1972
CapillaryVacuum Grease Oil (VM-4)68.628.Sidorov, Petrova, et al., 1972
CapillarySqualane70.629.8Dimov and Schopov, 1971Column length: 100. m; Column diameter: 0.25 mm
PackedSE-3080.628.Mitra and Saha, 1970N2
PackedSqualane25.630.Mitra and Saha, 1970N2
PackedSqualane80.630.Mitra and Saha, 1970N2
CapillarySqualane40.631.Matukuma, 1969N2; Column length: 91.4 m; Column diameter: 0.25 mm
PackedSqualane27.629.Hively and Hinton, 1968He, Chromosorb P; Column length: 15. m; Column diameter: 0.25 mm
PackedSqualane49.630.Hively and Hinton, 1968He, Chromosorb P; Column length: 15. m; Column diameter: 0.25 mm
PackedSqualane67.630.Hively and Hinton, 1968He, Chromosorb P; Column length: 15. m; Column diameter: 0.25 mm
PackedSqualane86.631.Hively and Hinton, 1968He, Chromosorb P; Column length: 15. m; Column diameter: 0.25 mm
PackedSqualane30.629.Tourres, 1967H2; Column length: 10. m
PackedSqualane50.630.Tourres, 1967H2; Column length: 10. m
CapillarySqualane30.629.Tourres, 1967, 2H2; Column length: 100. m; Column diameter: 0.25 mm
CapillarySqualane50.630.Tourres, 1967, 2H2; Column length: 100. m; Column diameter: 0.25 mm
CapillarySqualane70.630.Tourres, 1967, 2H2; Column length: 100. m; Column diameter: 0.25 mm
PackedSqualane100.631.Evans, 1966Untreated celite; Column length: 1.8 m
PackedSqualane22.629.Evans, 1966Untreated celite; Column length: 1.8 m
PackedSqualane30.629.Evans, 1966Untreated celite; Column length: 1.8 m
PackedSqualane40.632.Evans, 1966Untreated celite; Column length: 1.8 m
PackedSqualane55.631.Evans, 1966Untreated celite; Column length: 1.8 m
PackedSqualane60.630.Evans, 1966Untreated celite; Column length: 1.8 m
PackedSqualane70.630.Evans, 1966Untreated celite; Column length: 1.8 m
PackedSqualane80.630.Evans, 1966Untreated celite; Column length: 1.8 m
PackedDC-200100.633.Rohrschneider, 1966Column length: 4. m
PackedSqualane100.631.Rohrschneider, 1966Column length: 5. m
PackedApiezon L100.627.Rohrschneider, 1966Column length: 5. m
PackedSqualane26.630.Zulaïca and Guiochon, 1966Column length: 10. m

Kovats' RI, non-polar column, temperature ramp

View large format table.

Column type Active phase I Reference Comment
CapillaryOV-101623.Hayes and Pitzer, 1982110. m/0.25 mm/0.20 μm, He, 1. K/min; Tstart: 35. C; Tend: 200. C
CapillaryApiezon L621.Louis, 1971N2, 1. K/min; Column length: 50. m; Column diameter: 0.25 mm; Tstart: 60. C

Kovats' RI, non-polar column, custom temperature program

View large format table.

Column type Active phase I Reference Comment
CapillaryPetrocol DH-100630.6Haagen-Smit Laboratory, 1997He; Column length: 100. m; Column diameter: 0.2 mm; Program: 5C(10min) => 5C/min => 50C(48min) => 1.5C/min => 195C(91min)
CapillaryDB-1633.Hoekman, 199360. m/0.32 mm/1.0 μm, He; Program: -40 C for 12 min; -40 - 125 C at 3 deg.min; 125-185 C at 6 deg/min; 185 - 220 C at 20 deg/min; hold 220 C for 2 min

Kovats' RI, polar column, isothermal

View large format table.

Column type Active phase Temperature (C) I Reference Comment
PackedCarbowax 20M100.609.Rohrschneider, 1966Column length: 2. m

Van Den Dool and Kratz RI, non-polar column, temperature ramp

View large format table.

Column type Active phase I Reference Comment
CapillaryPetrocol DH627.1Censullo, Jones, et al., 200350. m/0.25 mm/0.5 μm, He, 35. C @ 10. min, 3. K/min, 200. C @ 10. min
CapillarySPB-1620.63LECO Corporation, 200330. m/0.25 mm/0.25 μm, 40. C @ 2. min, 10. K/min, 250. C @ 2. min
CapillarySPB-1621.45LECO Corporation, 200330. m/0.25 mm/0.25 μm, 40. C @ 2. min, 10. K/min, 250. C @ 2. min
CapillaryDB-5621.2Xu, van Stee, et al., 200330. m/0.25 mm/1. μm, He, 2.5 K/min; Tstart: 50. C; Tend: 200. C
CapillaryOV-101625.8Yin, Liu, et al., 2001N2, 1. K/min; Column length: 80. m; Column diameter: 0.22 mm; Tstart: 30. C; Tend: 130. C
CapillaryPONA620.3Martos, Saraullo, et al., 199750. m/0.2 mm/0.5 μm, 35. C @ 0.5 min, 1. K/min, 220. C @ 8. min
CapillaryPONA623.1Martos, Saraullo, et al., 199750. m/0.2 mm/0.5 μm, 35. C @ 0.5 min, 1. K/min, 220. C @ 8. min
CapillaryPetrocol DH623.73Subramaniam, Bochniak, et al., 1994100. m/0.25 mm/0.5 μm, He, 1. K/min; Tstart: 30. C; Tend: 220. C
CapillaryPetrocol DH623.75Subramaniam, Bochniak, et al., 1994100. m/0.25 mm/0.5 μm, He, 1. K/min; Tstart: 30. C; Tend: 220. C
CapillaryUltra-1630.Olson, Sinkevitch, et al., 19924. K/min; Tstart: -40. C; Tend: 230. C
CapillaryPetrocol DH624.White, Hackett, et al., 1992100. m/0.25 mm/0.5 μm, He, 1. K/min; Tstart: 30. C; Tend: 220. C
CapillaryMethyl Silicone624.Takeda, 199120. C @ 5. min, 2. K/min; Column length: 50. m; Column diameter: 0.20 mm; Tend: 250. C
CapillaryOV-101623.Hayes and Pitzer, 1981108. m/0.25 mm/0.2 μm, 1. K/min; Tstart: 35. C; Tend: 200. C

Van Den Dool and Kratz RI, non-polar column, custom temperature program

View large format table.

Column type Active phase I Reference Comment
CapillaryOV-101626.Wu and Lu, 1984Program: not specified

Normal alkane RI, non-polar column, isothermal

View large format table.

Column type Active phase Temperature (C) I Reference Comment
CapillaryOV-10140.630.Li and Deng, 1998N2; Column length: 51. m; Column diameter: 0.25 mm
CapillaryMethyl Silicone50.630.N/AN2; Column length: 74.6 m; Column diameter: 0.28 mm
CapillaryOV-10150.630.Wu and Lu, 1984, 2
CapillaryOV-10170.631.Wu and Lu, 1984, 2
CapillarySqualane100.632.Dimov N., 1976
CapillarySqualane70.630.Dimov N., 1976
CapillarySqualane86.621.Vigdergauz and Martynov, 1971He; Column length: 150. m; Column diameter: 0.35 mm
CapillaryApiezon L40. - 190.629.Mann, Mühlstädt, et al., 1967Column length: 2. m
PackedMethyl Silicone50.627.Huguet, 1961Nitrogen, Celite C-22; Column length: 2.5 m

Normal alkane RI, non-polar column, temperature ramp

View large format table.

Column type Active phase I Reference Comment
CapillaryPolydimethyl siloxane: CP-Sil 5 CB631.Bramston-Cook, 201360. m/0.25 mm/1.0 μm, Helium, 45. C @ 1.45 min, 3.6 K/min, 210. C @ 2.72 min
CapillaryPetrocol DH625.Supelco, 2012100. m/0.25 mm/0.50 μm, Helium, 20. C @ 15. min, 15. K/min, 220. C @ 30. min
CapillaryDB-1630.Ciccioli, Cecinato, et al., 199260. m/0.32 mm/1.2 μm, He, 30. C @ 10. min, 3. K/min; Tend: 240. C
CapillarySF-96634.Donetzhuber, Johansson, et al., 1976Nitrogen, 3. K/min, 130. C @ 40. min; Column length: 111. m; Column diameter: 0.76 mm; Initial hold: 8. min

Normal alkane RI, non-polar column, custom temperature program

View large format table.

Column type Active phase I Reference Comment
CapillaryMethyl Silicone631.Chen and Feng, 2007Program: not specified
CapillaryMethyl Silicone630.Feng and Mu, 2007Program: not specified
CapillaryMethyl Silicone631.Blunden, Aneja, et al., 200560. m/0.32 mm/1.0 μm, Helium; Program: -50 0C (2 min) 8 0C/min -> 200 0C (7.75 min) 25 0C -> 225 0C (8 min)
CapillaryOV-101630.Du and Liang, 2003Program: not specified
CapillaryPolydimethyl siloxane630.Junkes, Castanho, et al., 2003Program: not specified
CapillaryPolydimethyl siloxanes626.Yin, Guo, et al., 2001Program: not specified
CapillaryMethyl Silicone630.Zenkevich and Marinichev, 2001Program: not specified
CapillaryDB-1631.Zhu and Wang, 2001Program: not specified
CapillaryMethyl Silicone629.Spieksma, 1999Program: not specified
CapillarySE-54629.Zhu and He, 1999Program: not specified
CapillarySE-54630.Zhu and He, 1999Program: not specified
CapillaryDB-1626.Ciccioli, Cecinato, et al., 199460. m/0.32 mm/0.25 μm; Program: not specified
CapillaryOV-101628.Skrbic and Cvejanov, 1993Program: not specified
CapillarySqualane624.Petrov, 1984Program: not specified
CapillaryOV-1, SE-30, Methyl silicone, SP-2100, OV-101, DB-1, etc.632.Waggott and Davies, 1984Hydrogen; Column length: 50. m; Column diameter: 0.32 mm; Program: not specified
PackedApieson L630.Kojima, Fujii, et al., 1980Chromosorb W; Column length: 20. m; Program: not specified
PackedSE-30640.Robinson and Odell, 1971Chrom W; Column length: 6.1 m; Program: 50C(10min) => 20C/min(2min) => 90C(6min) => 10C/min(6min) => (hold at 150C)
PackedSqualane641.Robinson and Odell, 1971Embacel; Column length: 3.0 m; Program: 25C(5min) => 2C/min(5min) => 4C/min(15min) => (hold at 95C)

Normal alkane RI, polar column, temperature ramp

View large format table.

Column type Active phase I Reference Comment
CapillarySupelcowax-10611.Girard and Durance, 200060. m/0.25 mm/0.25 μm, He, 35. C @ 10. min, 4. K/min; Tend: 200. C

References

Prosen and Rossini, 1945
Prosen, E.J.; Rossini, F.D.,
Heats of combustion and formation of the paraffin hydrocarbons at 25° C,
J. Res. NBS, 1945, 263-267. [all data]
Davies and Gilbert, 1941
Davies, G.F.; Gilbert, E.C.,
Heats of combustion and formation of the nine isomeric heptanes in the liquid state,
J. Am. Chem. Soc., 1941, 63, 2730-2732. [all data]
Huffman H.M., 1961
Huffman H.M.,
Low temperature thermodynamic properties of six isomeric heptanes,
J. Phys. Chem., 1961, 65, 495-503. [all data]
Scott D.W., 1974
Scott D.W.,
Chemical Thermodynamic Properties of Hydrocarbons and Related Substances. Properties of the Alkane Hydrocarbons, C1 through C10 in the Ideal Gas State from 0 to 1500 K. U.S. Bureau of Mines, Bulletin 666, 1974. [all data]
Scott D.W., 1974, 2
Scott D.W.,
Correlation of the chemical thermodynamic properties of alkane hydrocarbons,
J. Chem. Phys., 1974, 60, 3144-3165. [all data]
Huffman, Gross, et al., 1961
Huffman, H.M.; Gross, M.E.; Scott, D.W.; McCullough, I.P.,
Low temperature thermodynamic properties of six isomeric heptanes,
J. Phys. Chem., 1961, 65, 495-503. [all data]
Huffman, Parks, et al., 1930
Huffman, H.M.; Parks, G.S.; Thomas, S.B.,
Thermal data on organic compounds. VIII. The heat capacities, entropies and free energies of the isomeric heptanes,
J. Am. Chem. Soc., 1930, 52, 3241-3251. [all data]
Daubert, 1996
Daubert, T.E.,
Vapor-Liquid Critical Properties of Elements and Compounds. 5. Branched Alkanes and Cycloalkanes,
J. Chem. Eng. Data, 1996, 41, 365-372. [all data]
McMicking and Kay, 1965
McMicking, J.H.; Kay, W.B.,
Vapor Pressures and Saturated Liquid and Vapor Densities of The Isomeric Heptanes and Isomeric Octanes,
Proc., Am. Pet. Inst., Sect. 3, 1965, 45, 75-90. [all data]
Francis, 1957
Francis, A.W.,
Pressure-Temperature-Liquid Density Relations of Pure Hydrocarbons,
Ind. Eng. Chem., 1957, 49, 1779. [all data]
Edgar and Calingaert, 1929
Edgar, G.; Calingaert, G.,
Preparation and Properties of the Isomeric Heptanes II. Physical Prop. properties,
J. Am. Chem. Soc., 1929, 51, 1540. [all data]
Majer and Svoboda, 1985
Majer, V.; Svoboda, V.,
Enthalpies of Vaporization of Organic Compounds: A Critical Review and Data Compilation, Blackwell Scientific Publications, Oxford, 1985, 300. [all data]
Svoboda, 1998
Svoboda, V.,
Enthalpies of vaporization, and the cohesive and internal energies of 2,2-dimethylpentane, 2,4-dimethylpentane, 2,2,3-trimethylpentane, 2,3,3-trimethylpentane, and 3-ethylpentane,
The Journal of Chemical Thermodynamics, 1998, 30, 11, 1411-1417, https://doi.org/10.1006/jcht.1998.0414
. [all data]
Osborne and Ginnings, 1947
Osborne, Nathan S.; Ginnings, Defoe C.,
Measurements of heat of vaporization and heat capacity of a number of hydrocarbons,
J. RES. NATL. BUR. STAN., 1947, 39, 5, 453-17, https://doi.org/10.6028/jres.039.031
. [all data]
Osborne and Ginnings, 1947, 2
Osborne, N.S.; Ginnings, D.C.,
Measurements of heat of vaporization and heat capacity of a number of hydrocarbons,
J. Res. NBS, 1947, 39, 453-477. [all data]
Stephenson and Malanowski, 1987
Stephenson, Richard M.; Malanowski, Stanislaw,
Handbook of the Thermodynamics of Organic Compounds, 1987, https://doi.org/10.1007/978-94-009-3173-2
. [all data]
Kkykj and Repas, 1973
Kkykj, J.; Repas, M.,
Petrochemia, 1973, 13, 179. [all data]
Forziati, Norris, et al., 1949
Forziati, Alphonse F.; Norris, William R.; Rossini, Frederick D.,
Vapor pressures and boiling points of sixty API-NBS hydrocarbons,
J. RES. NATL. BUR. STAN., 1949, 43, 6, 555-17, https://doi.org/10.6028/jres.043.050
. [all data]
Forziati, Norris, et al., 1949, 2
Forziati, A.F.; Norris, W.R.; Rossini, F.D.,
Vapor Pressures and Boiling Points of Sixty API-NBS Hydrocarbons,
J. Res. Natl. Bur. Stand. (U.S.), 1949, 43, 6, 555-563, https://doi.org/10.6028/jres.043.050
. [all data]
Domalski and Hearing, 1996
Domalski, Eugene S.; Hearing, Elizabeth D.,
Heat Capacities and Entropies of Organic Compounds in the Condensed Phase. Volume III,
J. Phys. Chem. Ref. Data, 1996, 25, 1, 1, https://doi.org/10.1063/1.555985
. [all data]
Rogers and Dejroongruang, 1989
Rogers, D.W.; Dejroongruang, K.,
Enthalpies of hydrogenation of the dimethylpentenes, ethylpentenes, methylbutene, and trimethylbutene,
J. Chem. Thermodyn., 1989, 21, 1115-1120. [all data]
Turner, Nettleton, et al., 1958
Turner, R.B.; Nettleton, J.E.; Perelman,
Heats of Hydrogenation. VI. Heats of hydrogenation of some substituted ethylenes,
J. Am. Chem. Soc., 1958, 80, 1430-1433. [all data]
Prosen and Rossini, 1941
Prosen, E.J.R.; Rossini, F.D.,
Heats of isomerization of the nine heptanes,
J. Res. NBS, 1941, 27, 519-528. [all data]