Triethoxymethane
- Formula: C7H16O3
- Molecular weight: 148.2001
- IUPAC Standard InChIKey: GKASDNZWUGIAMG-UHFFFAOYSA-N
- CAS Registry Number: 108055-42-1
- Chemical structure:
View 3d structure (requires JavaScript / HTML 5) - Species with the same structure:

Gas phase thermochemistry data

Data compiled by: Hussein Y. Afeefy, Joel F. Liebman, and Stephen E. Stein
Quantity | Value | Units | Method | Reference | Comment |
---|---|---|---|---|---|
ΔfH°gas | -630.6 ± 1.5 | kJ/mol | Ccr | Marsh and Mansson, 1985 |

Condensed phase thermochemistry data

Data compiled by: Hussein Y. Afeefy, Joel F. Liebman, and Stephen E. Stein
Quantity | Value | Units | Method | Reference | Comment |
---|---|---|---|---|---|
ΔfH°liquid | -678.4 ± 1.5 | kJ/mol | Ccr | Marsh and Mansson, 1985 | |
Quantity | Value | Units | Method | Reference | Comment |
ΔcH°liquid | -4362.8 ± 1.1 | kJ/mol | Ccr | Marsh and Mansson, 1985 | Corresponding ΔfHºliquid = -678.4 kJ/mol (simple calculation by NIST; no Washburn corrections) |

Phase change data

Data compiled as indicated in comments:
ALS - Hussein Y. Afeefy, Joel F. Liebman, and Stephen E. Stein
DRB - Donald R. Burgess, Jr.
Quantity | Value | Units | Method | Reference | Comment |
---|---|---|---|---|---|
ΔvapH° | 47.8 ± 0.1 | kJ/mol | C | Marsh and Mansson, 1985 | ALS |
ΔvapH° | 47.8 | kJ/mol | N/A | Marsh and Mansson, 1985 | DRB |

References

Marsh and Mansson, 1985
Marsh, K.N.; Mansson, M.,
Standard molar enthalpies of formation of triethoxymethane and tetraethoxymethane by rotating bomb calorimetry,
J. Chem. Thermodyn., 1985, 17, 995-1002. [all data]