Propanoic acid, 3-chloro-
- Formula: C3H5ClO2
- Molecular weight: 108.524
- IUPAC Standard InChIKey: QEYMMOKECZBKAC-UHFFFAOYSA-N
- CAS Registry Number: 107-94-8
- Chemical structure:
View 3d structure (requires JavaScript / HTML 5) - Other names: Propionic acid, 3-chloro-; β-Chloropropionic acid; β-Monochloropropionic acid; 3-Chloropropanoic acid; 3-Chloropropionic acid

Condensed phase thermochemistry data

Data compiled by: Hussein Y. Afeefy, Joel F. Liebman, and Stephen E. Stein
Quantity | Value | Units | Method | Reference | Comment |
---|---|---|---|---|---|
ΔcH°solid | -1370. ± 3. | kJ/mol | Ccb | Smith, Bjellerup, et al., 1953 | |
ΔcH°solid | -1366. | kJ/mol | Ccb | Schjanberg, 1935 |

Phase change data

Data compiled as indicated in comments:
BS - Robert L. Brown and Stephen E. Stein
TRC - Thermodynamics Research Center, NIST Boulder Laboratories, Chris Muzny director
Quantity | Value | Units | Method | Reference | Comment |
---|---|---|---|---|---|
Tboil | 477.2 | K | N/A | Aldrich Chemical Company Inc., 1990 | BS |
Quantity | Value | Units | Method | Reference | Comment |
Tfus | 314. | K | N/A | Joyce, Hanford, et al., 1948 | Uncertainty assigned by TRC = 4. K; TRC |

Reaction thermochemistry data

Data compiled by: John E. Bartmess
Individual Reactions
C3H4ClO2- + =
By formula: C3H4ClO2- + H+ = C3H5ClO2
Quantity | Value | Units | Method | Reference | Comment |
---|---|---|---|---|---|
ΔrH° | 1426. ± 11. | kJ/mol | G+TS | Caldwell, Renneboog, et al., 1989 | gas phase |
ΔrH° | 1426. ± 16. | kJ/mol | G+TS | Cumming and Kebarle, 1978 | gas phase |
Quantity | Value | Units | Method | Reference | Comment |
ΔrG° | 1397. ± 8.4 | kJ/mol | IMRE | Caldwell, Renneboog, et al., 1989 | gas phase |
ΔrG° | 1397. ± 8.4 | kJ/mol | IMRE | Cumming and Kebarle, 1978 | gas phase |

Gas phase ion energetics data

Data compiled by: John E. Bartmess
De-protonation reactions
C3H4ClO2- + =
By formula: C3H4ClO2- + H+ = C3H5ClO2
Quantity | Value | Units | Method | Reference | Comment |
---|---|---|---|---|---|
ΔrH° | 1426. ± 11. | kJ/mol | G+TS | Caldwell, Renneboog, et al., 1989 | gas phase |
ΔrH° | 1426. ± 16. | kJ/mol | G+TS | Cumming and Kebarle, 1978 | gas phase |
Quantity | Value | Units | Method | Reference | Comment |
ΔrG° | 1397. ± 8.4 | kJ/mol | IMRE | Caldwell, Renneboog, et al., 1989 | gas phase |
ΔrG° | 1397. ± 8.4 | kJ/mol | IMRE | Cumming and Kebarle, 1978 | gas phase |

Kovats' RI, non-polar column, isothermal

View large format table.

Column type Active phase Temperature (C) I Reference Comment
PackedE-301170.970.Shashkova, Znamenskaia, et al., 1969He, Celite 545 (0.20-0.50 mm); Column length: 2. m

Van Den Dool and Kratz RI, non-polar column, custom temperature program

View large format table.

Column type Active phase I Reference Comment
CapillaryVF-5MS960.4Tret'yakov, 200730. m/0.25 mm/0.25 μm, He; Program: Multi-step temperature program; T(initial)=60C; T(final)=270C

References

Smith, Bjellerup, et al., 1953
Smith, L.; Bjellerup, L.; Krook, S.; Westermark, H.,
Heats of combustion of organic chloro compounds determined by the "quartz wool" method,
Acta Chem. Scand., 1953, 7, 65. [all data]
Schjanberg, 1935
Schjanberg, E.,
Die Verbrennungswarmen und die Refraktionsdaten einiger chlorsubstituierter Fettsauren und Ester.,
Z. Phys. Chem. Abt. A, 1935, 172, 197-233. [all data]
Aldrich Chemical Company Inc., 1990
Aldrich Chemical Company Inc.,
Catalog Handbook of Fine Chemicals, Aldrich Chemical Company, Inc., Milwaukee WI, 1990, 1. [all data]
Joyce, Hanford, et al., 1948
Joyce, R.M.; Hanford, W.E.; Harmon, J.,
J. Am. Chem. Soc., 1948, 70, 2529. [all data]
Caldwell, Renneboog, et al., 1989
Caldwell, G.; Renneboog, R.; Kebarle, P.,
Gas Phase Acidities of Aliphatic Carboxylic Acids, Based on Measurements of Proton Transfer Equilibria,
Can. J. Chem., 1989, 67, 4, 661, https://doi.org/10.1139/v89-092
. [all data]
Cumming and Kebarle, 1978
Cumming, J.B.; Kebarle, P.,
Summary of gas phase measurements involving acids AH. Entropy changes in proton transfer reactions involving negative ions. Bond dissociation energies D(A-H) and electron affinities EA(A),
Can. J. Chem., 1978, 56, 1. [all data]