Benzo[b]thiophene-4-ol, methylcarbamate
- Formula: C10H9NO2S
- Molecular weight: 207.249
- IUPAC Standard InChIKey: BOTUVXISJHKZKJ-UHFFFAOYSA-N
- CAS Registry Number: 1079-33-0
- Chemical structure:
View 3d structure (requires JavaScript / HTML 5) - Other names: Mobam; Carbamic acid, methyl-, benzo[b]thien-4-yl ester; Benzo[b]thien-4-yl methylcarbamate; Mobam phenol; Mobil MC-A-600; MCA 600; 4-Benzothienyl methylcarbamate; 4-Benzothienylester kyseliny methylkarbaminove; ENT-27041; MOS-708; OMS-708

Phase change data

Data compiled by: Thermodynamics Research Center, NIST Boulder Laboratories, Chris Muzny director
Quantity | Value | Units | Method | Reference | Comment |
---|---|---|---|---|---|
Tfus | 402.8 | K | N/A | Plato, 1972 | Uncertainty assigned by TRC = 0.2 K |

Kovats' RI, non-polar column, temperature ramp

Column type | Active phase | I | Reference | Comment |
---|---|---|---|---|
Capillary | DB-1 | 1873. | Hall, Whitehead, et al., 1986 | He, 6. K/min; Column length: 15. m; Column diameter: 0.25 mm; Tstart: 100. C; Tend: 270. C |

References

Plato, 1972
Plato, C.,
DSC as a general method for determining purity and heat of fusion of high-purity organic chemicals,
Anal. Chem., 1972, 44, 1531. [all data]
Hall, Whitehead, et al., 1986
Hall, G.L.; Whitehead, W.E.; Mourer, C.R.; Shibamoto, T.,
A new gas chromatographic retention index for pesticides and related compounds,
J. Hi. Res. Chromatogr. Chromatogr. Comm., 1986, 9, 5, 266-271, https://doi.org/10.1002/jhrc.1240090503
. [all data]