Acetamide, 2-cyano-
- Formula: C3H4N2O
- Molecular weight: 84.0767
- IUPAC Standard InChIKey: DGJMPUGMZIKDRO-UHFFFAOYSA-N
- CAS Registry Number: 107-91-5
- Chemical structure:
View 3d structure (requires JavaScript / HTML 5) - Other names: Cyanacetamide; Cyanoacetamide; Malonamide nitrile; Malonamonitrile; Nitrilomalonamide; 2-Cyanoacetamide; Amid kyseliny kyanoctove; CAA; Kyanacetamid; Propionamide, 3-nitrilo-; USAF KF-14; 3-Nitrilo-propionamide; α-Cyanoacetamide; Cyanoiminoacetic acid; NSC 6285

Condensed phase thermochemistry data

Data compiled as indicated in comments:
ALS - Hussein Y. Afeefy, Joel F. Liebman, and Stephen E. Stein
DH - Eugene S. Domalski and Elizabeth D. Hearing
Quantity | Value | Units | Method | Reference | Comment |
---|---|---|---|---|---|
ΔfH°solid | -175.6 | kJ/mol | Ccb | Guinchant, 1918 | Author hf288_condensed[kcal/mol]=-42.2 kcal/mol; ALS |
Quantity | Value | Units | Method | Reference | Comment |
ΔcH°solid | -1577. | kJ/mol | Ccb | Guinchant, 1918 | Author hf288_condensed[kcal/mol]=-42.2 kcal/mol; ALS |
Constant pressure heat capacity of solid
Cp,solid (J/mol*K) | Temperature (K) | Reference | Comment |
---|---|---|---|
111.1 | 300. | DeWit, Offringa, et al., 1983 | T = 300 to 450 K.; DH |

Phase change data

Data compiled as indicated in comments:
TRC - Thermodynamics Research Center, NIST Boulder Laboratories, Chris Muzny director
AC - William E. Acree, Jr., James S. Chickos
CAL - James S. Chickos, William E. Acree, Jr., Joel F. Liebman, Students of Chem 202 (Introduction to the Literature of Chemistry), University of Missouri -- St. Louis
DH - Eugene S. Domalski and Elizabeth D. Hearing
Quantity | Value | Units | Method | Reference | Comment |
---|---|---|---|---|---|
Tfus | 387.3 | K | N/A | De Wit, Offringa, et al., 1983 | Crystal phase 1 phase; Uncertainty assigned by TRC = 0.2 K; TRC |
Enthalpy of sublimation
ΔsubH (kJ/mol) | Temperature (K) | Method | Reference | Comment |
---|---|---|---|---|
99.7 | 336. | TE,ME | De Wit, Van Miltenburg, et al., 1983 | Based on data from 325. to 348. K.; AC |
Enthalpy of fusion
ΔfusH (kJ/mol) | Temperature (K) | Reference | Comment |
---|---|---|---|
21.7 | 387.3 | Domalski and Hearing, 1996 | AC |
Entropy of fusion
ΔfusS (J/mol*K) | Temperature (K) | Reference | Comment |
---|---|---|---|
3.46 | 346.5 | Domalski and Hearing, 1996 | CAL |
56.03 | 387.3 |
Enthalpy of phase transition
ΔHtrs (kJ/mol) | Temperature (K) | Initial Phase | Final Phase | Reference | Comment |
---|---|---|---|---|---|
1.200 | 346.5 | crystaline, II | crystaline, I | DeWit, Offringa, et al., 1983 | DH |
21.700 | 387.3 | crystaline, I | liquid | DeWit, Offringa, et al., 1983 | DH |
Entropy of phase transition
ΔStrs (J/mol*K) | Temperature (K) | Initial Phase | Final Phase | Reference | Comment |
---|---|---|---|---|---|
3.46 | 346.5 | crystaline, II | crystaline, I | DeWit, Offringa, et al., 1983 | DH |
56.0 | 387.3 | crystaline, I | liquid | DeWit, Offringa, et al., 1983 | DH |

References

Guinchant, 1918
Guinchant, M.J.,
Etude sur la fonction acide dans les derives metheniques et methiniques,
Ann. Chem., 1918, 10, 30-84. [all data]
DeWit, Offringa, et al., 1983
DeWit, H.G.M.; Offringa, J.C.A.; De Kruif, C.G.; Van Miltenburg, J.C.,
Thermodynamic properties of molecular organic crystals containing nitrogen, oxygen and sulfur. III. Molar heat capacities measured by differential scanning calorimetry,
Thermochim. Acta, 1983, 65, 43-51. [all data]
De Wit, Offringa, et al., 1983
De Wit, H.G.M.; Offringa, J.C.A.; De Kruif, C.G.; van Miltenburg, J.C.,
Thremodynamic properties of molecular organic crystals containing nitrogen, oxygen and sulfur. III. molar heat capacities measured by DSC. scanning calorimetry.,
Thermochim. Acta, 1983, 65, 43. [all data]
De Wit, Van Miltenburg, et al., 1983
De Wit, H.G.M.; Van Miltenburg, J.C.; De Kruif, C.G.,
Thermodynamic properties of molecular organic crystals containing nitrogen, oxygen, and sulphur 1. Vapour pressures and enthalpies of sublimation,
The Journal of Chemical Thermodynamics, 1983, 15, 7, 651-663, https://doi.org/10.1016/0021-9614(83)90079-4
. [all data]
Domalski and Hearing, 1996
Domalski, Eugene S.; Hearing, Elizabeth D.,
Heat Capacities and Entropies of Organic Compounds in the Condensed Phase. Volume III,
J. Phys. Chem. Ref. Data, 1996, 25, 1, 1, https://doi.org/10.1063/1.555985
. [all data]