Quinoline, 6-methoxy-2-methyl-
- Formula: C11H11NO
- Molecular weight: 173.2111
- IUPAC Standard InChIKey: NAGJQQFMJKMXJQ-UHFFFAOYSA-N
- CAS Registry Number: 1078-28-0
- Chemical structure:
View 3d structure (requires JavaScript / HTML 5) - Other names: Quinaldine, 6-methoxy-; 2-Methyl-6-methoxyquinoline; 6-Methoxy-2-methylquinoline; 6-Methoxyquinaldine

Phase change data

Data compiled by: Thermodynamics Research Center, NIST Boulder Laboratories, Chris Muzny director
Quantity | Value | Units | Method | Reference | Comment |
---|---|---|---|---|---|
Tfus | 340. | K | N/A | Kost, Yurkevich, et al., 1955 | Uncertainty assigned by TRC = 3. K |

Normal alkane RI, non-polar column, custom temperature program

Column type | Active phase | I | Reference | Comment |
---|---|---|---|---|
Capillary | HP-5 | 1514. | Zhao, Li, et al., 2008 | 30. m/0.25 mm/0.25 μm; Program: 40 0C (2 min) 5 0C/min -> 80 0C 7 oC/min -> 160 0C 9 0C/min -> 200 0C 20 0C/min -> 280 0C (10 min) |

References

Kost, Yurkevich, et al., 1955
Kost, A.N.; Yurkevich, A.M.; Yudin, L.G.; Shchegoleva, T.A.,
Reaction of vinyl ethers with amines.,
Zh. Obshch. Khim., 1955, 25, 943-7. [all data]
Zhao, Li, et al., 2008
Zhao, Y.; Li, J.; Xu, Y.; Duan, H.; Fan, W.; Zhao, G.,
EXtraction, preparation and identification of volatile compounds in Changyu XO brandy,
Chinese J. Chromatogr., 2008, 26, 2, 212-222, https://doi.org/10.1016/S1872-2059(08)60014-0
. [all data]