Butane, 1-bromo-3-methyl-
- Formula: C5H11Br
- Molecular weight: 151.045
- IUPAC Standard InChIKey: YXZFFTJAHVMMLF-UHFFFAOYSA-N
- CAS Registry Number: 107-82-4
- Chemical structure:
View 3d structure (requires JavaScript / HTML 5) - Other names: Isoamyl bromide; Isopentyl bromide; 1-Bromo-3-methylbutane; 3-Methylbutyl bromide; 4-Bromo-2-methylbutane; BrCH2CH2CH(CH3)2; UN 2341

Condensed phase thermochemistry data

Data compiled by: Eugene S. Domalski and Elizabeth D. Hearing
Constant pressure heat capacity of liquid
Cp,liquid (J/mol*K) | Temperature (K) | Reference | Comment |
---|---|---|---|
187.0 | 298. | Kurbatov, 1948 | T = 12 to 100·C, mean Cp, two temperatures. |

Phase change data

Data compiled as indicated in comments:
BS - Robert L. Brown and Stephen E. Stein
TRC - Thermodynamics Research Center, NIST Boulder Laboratories, Chris Muzny director
AC - William E. Acree, Jr., James S. Chickos
ALS - Hussein Y. Afeefy, Joel F. Liebman, and Stephen E. Stein
Quantity | Value | Units | Method | Reference | Comment |
---|---|---|---|---|---|
Tboil | 394. ± 1. | K | AVG | N/A | Average of 14 values; Individual data points |
Enthalpy of vaporization
ΔvapH (kJ/mol) | Temperature (K) | Method | Reference | Comment |
---|---|---|---|---|
37.9 | 321. | A | Stephenson and Malanowski, 1987 | Based on data from 306. to 436. K. See also Dykyj, 1972.; AC |
41. | 268. | N/A | Stull, 1947 | Based on data from 253. to 393. K.; AC |
36.6 | 394.6 | V | Mathews and Fehlandt, 1931 | ALS |
Antoine Equation Parameters
log10(P) = A − (B / (T + C))
P = vapor pressure (bar)
T = temperature (K)
View plot Requires a JavaScript / HTML 5 canvas capable browser.
Temperature (K) | A | B | C | Reference | Comment |
---|---|---|---|---|---|
252.8 to 393.6 | 4.25081 | 1480.387 | -44.998 | Stull, 1947 | Coefficents calculated by NIST from author's data. |

Henry's Law data

Data compiled by: Rolf Sander
Henry's Law constant (water solution)
kH(T) = k°H exp(d(ln(kH))/d(1/T) ((1/T) - 1/(298.15 K)))
k°H = Henry's law constant for solubility in water at 298.15 K (mol/(kg*bar))
d(ln(kH))/d(1/T) = Temperature dependence constant (K)
k°H (mol/(kg*bar)) | d(ln(kH))/d(1/T) (K) | Method | Reference |
---|---|---|---|
0.029 | V | N/A |

Kovats' RI, polar column, isothermal

Data compiled by: NIST Mass Spectrometry Data Center, William E. Wallace, director

Column type PackedPackedPacked
Active phase Carbowax 20MCarbowax 20MCarbowax 20M
Column length (m) 3.3.3.
Carrier gas HeHeHe
Substrate Chromosorb W AW DMCSChromosorb W AW DMCSChromosorb W AW DMCS
Column diameter (mm)
Phase thickness (μm)
Temperature (C) 100.125.75.
I 1002.1009.991.
ReferenceCastello and D'Amato, 1985Castello and D'Amato, 1985Castello and D'Amato, 1985
Comment MSDC-RI MSDC-RI MSDC-RI

References

Kurbatov, 1948
Kurbatov, V.Ya.,
Heat capacity of liquids. 2. Heat capacity and the temperature dependence of heat capacity from halogen derivatives of acylic hydrocarbons,
Zh. Obshch. Kim., 1948, 18, 372-389. [all data]
Stephenson and Malanowski, 1987
Stephenson, Richard M.; Malanowski, Stanislaw,
Handbook of the Thermodynamics of Organic Compounds, 1987, https://doi.org/10.1007/978-94-009-3173-2
. [all data]
Dykyj, 1972
Dykyj, J.,
Petrochemia, 1972, 12, 1, 13. [all data]
Stull, 1947
Stull, Daniel R.,
Vapor Pressure of Pure Substances. Organic and Inorganic Compounds,
Ind. Eng. Chem., 1947, 39, 4, 517-540, https://doi.org/10.1021/ie50448a022
. [all data]
Mathews and Fehlandt, 1931
Mathews, J.H.; Fehlandt, P.R.,
The heats of vaporization of some organic compounds,
J. Am. Chem. Soc., 1931, 53, 3212-32. [all data]