Butane, 1,3-dibromo-
- Formula: C4H8Br2
- Molecular weight: 215.914
- IUPAC Standard InChIKey: XZNGUVQDFJHPLU-UHFFFAOYSA-N
- CAS Registry Number: 107-80-2
- Chemical structure:
View 3d structure (requires JavaScript / HTML 5) - Other names: 1,3-Dibromobutane

Gas phase thermochemistry data

Data compiled by: Hussein Y. Afeefy, Joel F. Liebman, and Stephen E. Stein
Quantity | Value | Units | Method | Reference | Comment |
---|---|---|---|---|---|
ΔfH°gas | -97.28 | kJ/mol | Eqk | Rozhnov and Nesterova, 1973 |

Condensed phase thermochemistry data

Data compiled by: Hussein Y. Afeefy, Joel F. Liebman, and Stephen E. Stein
Quantity | Value | Units | Method | Reference | Comment |
---|---|---|---|---|---|
ΔfH°liquid | -147.8 ± 5.1 | kJ/mol | Eqk | Rozhnov and Nesterova, 1973 | Reanalyzed by Pedley, Naylor, et al., 1986, Original value = -146.8 kJ/mol |

Phase change data

Data compiled as indicated in comments:
BS - Robert L. Brown and Stephen E. Stein
TRC - Thermodynamics Research Center, NIST Boulder Laboratories, Chris Muzny director
ALS - Hussein Y. Afeefy, Joel F. Liebman, and Stephen E. Stein
AC - William E. Acree, Jr., James S. Chickos
Quantity | Value | Units | Method | Reference | Comment |
---|---|---|---|---|---|
Tboil | 447.2 | K | N/A | Weast and Grasselli, 1989 | BS |
Tboil | 448.15 | K | N/A | Kazanskii and Lukina, 1952 | Uncertainty assigned by TRC = 1.5 K; TRC |
Tboil | 447.65 | K | N/A | Dem'yanov, 1892 | Uncertainty assigned by TRC = 2. K; TRC |
Quantity | Value | Units | Method | Reference | Comment |
ΔvapH° | 49.50 | kJ/mol | E | Rozhnov and Nesterova, 1973 | ALS |
Enthalpy of vaporization
ΔvapH (kJ/mol) | Temperature (K) | Method | Reference | Comment |
---|---|---|---|---|
44.7 | 366. | A | Stephenson and Malanowski, 1987 | Based on data from 351. to 450. K.; AC |

Reaction thermochemistry data

Data compiled by: Hussein Y. Afeefy, Joel F. Liebman, and Stephen E. Stein
Individual Reactions
By formula: C4H8Br2 = C4H8Br2
Quantity | Value | Units | Method | Reference | Comment |
---|---|---|---|---|---|
ΔrH° | -6.0 ± 0.3 | kJ/mol | Eqk | Rozhnov, Nesterova, et al., 1972 | liquid phase |
By formula: C4H8Br2 = C4H8Br2
Quantity | Value | Units | Method | Reference | Comment |
---|---|---|---|---|---|
ΔrH° | -2.1 ± 0.08 | kJ/mol | Eqk | Nesterova, Rozhnov, et al., 1973 | liquid phase |

Normal alkane RI, non-polar column, isothermal

Column type | Active phase | Temperature (C) | I | Reference | Comment |
---|---|---|---|---|---|
Capillary | Apiezon L | 130. | 987. | Arruda, Junkes, et al., 2008 |

Normal alkane RI, non-polar column, custom temperature program

Column type | Active phase | I | Reference | Comment |
---|---|---|---|---|
Capillary | Methyl Silicone | 964. | Zenkevich and Marinichev, 2001 | Program: not specified |
Capillary | OV-1, SE-30, Methyl silicone, SP-2100, OV-101, DB-1, etc. | 973. | Waggott and Davies, 1984 | Hydrogen; Column length: 50. m; Column diameter: 0.32 mm; Program: not specified |

References

Rozhnov and Nesterova, 1973
Rozhnov, A.M.; Nesterova, T.N.,
Heats of formation of dibromo-n-butanes,
Russ. J. Phys. Chem. (Engl. Transl.), 1973, 47, 1390, In original 2455. [all data]
Pedley, Naylor, et al., 1986
Pedley, J.B.; Naylor, R.D.; Kirby, S.P.,
Thermochemical Data of Organic Compounds, Chapman and Hall, New York, 1986, 1-792. [all data]
Weast and Grasselli, 1989
CRC Handbook of Data on Organic Compounds, 2nd Editon, Weast,R.C and Grasselli, J.G., ed(s)., CRC Press, Inc., Boca Raton, FL, 1989, 1. [all data]
Kazanskii and Lukina, 1952
Kazanskii, B.A.; Lukina, M.Y.,
1,3-Dibromobutane,
Sint. Org. Soedin., 1950-52, 1952, 2, 79. [all data]
Dem'yanov, 1892
Dem'yanov, N.,
Zh. Russ. Fiz.-Khim. O-va., 1892, 24, 346. [all data]
Stephenson and Malanowski, 1987
Stephenson, Richard M.; Malanowski, Stanislaw,
Handbook of the Thermodynamics of Organic Compounds, 1987, https://doi.org/10.1007/978-94-009-3173-2
. [all data]
Rozhnov, Nesterova, et al., 1972
Rozhnov, A.M.; Nesterova, T.N.; Kovaleva, T.V.,
Isomerization of dibromobutanes. I. Isomerization of 1,2-, 1,3-, and 1,4-dibromobutanes.,
Zh. Org. Khim., 1972, 8, 1560-1564. [all data]
Nesterova, Rozhnov, et al., 1973
Nesterova, T.N.; Rozhnov, A.M.; Kovaleva, T.V.,
Isomerisation equilibrium of 1,2-, 1,3-, and 2,3-dibromobutanes,
Russ. J. Phys. Chem. (Engl. Transl.), 1973, 47, 755-756. [all data]
Arruda, Junkes, et al., 2008
Arruda, A.C.S.; Junkes, B. da.S.; Souza, E.S.; Yunes, R.A.; Heizen, V.E.F.,
Semi-Emlirical Topological Index to Predict Properties of Halogenated Aliphatic Compounds,
J. Chemometrics, 2008, 22, 3-4, 186-194, https://doi.org/10.1002/cem.1121
. [all data]
Zenkevich and Marinichev, 2001
Zenkevich, I.G.; Marinichev, A.N.,
Comparison of Topological and Dynamics Molecular Characteristics for Precalculation of Chromatographic Retention Parameters of Organic Compounds (in Russian),
Zh. Struct. Khim., 2001, 42, 5, 893-902. [all data]
Waggott and Davies, 1984
Waggott, A.; Davies, I.W.,
Identification of organic pollutants using linear temperature programmed retention indices (LTPRIs) - Part II, 1984, retrieved from http://dwi.defra.gov.uk/research/completed-research/reports/dwi0383.pdf. [all data]