2-Tert-butylbenzoic acid
- Formula: C11H14O2
- Molecular weight: 178.2277
- IUPAC Standard InChIKey: ZDFKSZDMHJHQHS-UHFFFAOYSA-N
- CAS Registry Number: 1077-58-3
- Chemical structure:
View 3d structure (requires JavaScript / HTML 5) - Permanent link for this species. Use this link for bookmarking this species for future reference.

Phase change data

Data compiled as indicated in comments:
TRC - Thermodynamics Research Center, NIST Boulder Laboratories, Chris Muzny director
DRB - Donald R. Burgess, Jr.
ALS - Hussein Y. Afeefy, Joel F. Liebman, and Stephen E. Stein
AC - William E. Acree, Jr., James S. Chickos
Quantity | Value | Units | Method | Reference | Comment |
---|---|---|---|---|---|
Tfus | 341.7 | K | N/A | Crawford and Stewart, 1952 | Uncertainty assigned by TRC = 2. K; TRC |
Tfus | 353.7 | K | N/A | Serijan, Hipsher, et al., 1949 | Uncertainty assigned by TRC = 1. K; TRC |
Tfus | 353.7 | K | N/A | Serijan, Wise, et al., 1949 | Uncertainty assigned by TRC = 0.2 K; TRC |
Quantity | Value | Units | Method | Reference | Comment |
ΔsubH° | 23.92 | kcal/mol | N/A | Colomina, Jimenez, et al., 1979 | DRB |
Enthalpy of sublimation
ΔsubH (kcal/mol) | Temperature (K) | Method | Reference | Comment |
---|---|---|---|---|
23.9 ± 0.2 | 314.6 | V | Colomina, Jimenez, et al., 1979 | ALS |
23.9 ± 0.1 | 315. | ME | Colomina, Jimenez, et al., 1979 | Based on data from 306. to 322. K.; AC |

Gas phase ion energetics data

Data compiled by: John E. Bartmess
De-protonation reactions
C11H13O2- + =
By formula: C11H13O2- + H+ = C11H14O2
Quantity | Value | Units | Method | Reference | Comment |
---|---|---|---|---|---|
ΔrH° | 336.4 ± 2.2 | kcal/mol | G+TS | Kulhanek, Decouzon, et al., 1999 | gas phase |
Quantity | Value | Units | Method | Reference | Comment |
ΔrG° | 329.3 ± 2.0 | kcal/mol | IMRE | Kulhanek, Decouzon, et al., 1999 | gas phase |

Condensed phase thermochemistry data

Data compiled by: Hussein Y. Afeefy, Joel F. Liebman, and Stephen E. Stein
Quantity | Value | Units | Method | Reference | Comment |
---|---|---|---|---|---|
ΔfH°solid | -113.8 ± 0.45 | kcal/mol | Ccb | Colomina, Jimenez, et al., 1979 | |
Quantity | Value | Units | Method | Reference | Comment |
ΔcH°solid | -1398.96 ± 0.28 | kcal/mol | Ccb | Colomina, Jimenez, et al., 1979 | Corresponding ΔfHºsolid = -113.81 kcal/mol (simple calculation by NIST; no Washburn corrections) |

Gas phase thermochemistry data

Data compiled by: Hussein Y. Afeefy, Joel F. Liebman, and Stephen E. Stein
Quantity | Value | Units | Method | Reference | Comment |
---|---|---|---|---|---|
ΔfH°gas | -89.89 ± 0.50 | kcal/mol | Ccb | Colomina, Jimenez, et al., 1979 |

Reaction thermochemistry data

Data compiled by: John E. Bartmess

Individual Reactions

C11H13O2- + Hydrogen cation = 2-Tert-butylbenzoic acid

By formula: C11H13O2- + H+ = C11H14O2

Quantity Value Units Method Reference Comment
Δr1407. ± 9.2kJ/molG+TSKulhanek, Decouzon, et al., 1999gas phase
Quantity Value Units Method Reference Comment
Δr1378. ± 8.4kJ/molIMREKulhanek, Decouzon, et al., 1999gas phase

References

Crawford and Stewart, 1952
Crawford, M.; Stewart, F.H.C.,
The Preparation of Some Alkyl-substituted Benzoic Acids,
J. Chem. Soc., 1952, 1952, 4443-7. [all data]
Serijan, Hipsher, et al., 1949
Serijan, K.T.; Hipsher, H.F.; Gibbons, L.C.,
O-, m- and p-t-butyltoluenes,
J. Am. Chem. Soc., 1949, 71, 873-5. [all data]
Serijan, Wise, et al., 1949
Serijan, K.T.; Wise, P.H.; Gibbons, L.C.,
The physical properties of five isomeric methyl-t-butylcyclohexanes,
J. Am. Chem. Soc., 1949, 71, 2265-6. [all data]
Colomina, Jimenez, et al., 1979
Colomina, M.; Jimenez, P.; Perez-Ossorio, R.; Turrion, C.,
Thermochemical properties of benzoic acid derivatives. VIII. Enthalpies of combustion and formation of o-, m-, and p-t-butylbenzoic acids,
J. Chem. Thermodyn., 1979, 11, 1179-1184. [all data]