Thioctic acid
- Formula: C8H14O2S2
- Molecular weight: 206.326
- IUPAC Standard InChIKey: AGBQKNBQESQNJD-UHFFFAOYSA-N
- CAS Registry Number: 1077-28-7
- Chemical structure:
View 3d structure (requires JavaScript / HTML 5) - Other names: dl-Thioctic acid; dl-α-Lipoic acid; dl-6,8-Thioctic acid; 1,2-Dithiolane-3-pentanoic acid, (.+/-.)-; DL-6-Thioctic acid; 1,2-Dithiolane-3-valeric acid, (.+/-.)-; Thiooctic acid; DL-1,2-Dithiolane 3-valeric acid; DL-1,2-Dithiolan-3-valeriansaeure; dl-1,2-Dithiolane-3-pentanoic acid; Thioctic acid, dl-form; NSC 628502; NSC 90788; dl-Lipoic acid; 5-(1,2-Dithiolan-3-yl)valeric acid; (.+/-.)-Lipoic acid; 1,2-Dithiolane-3-pentanoic acid; α-Lipoic acid; 5-(dithiolan-3-yl)valeric acid

Reaction thermochemistry data

Data compiled by: Hussein Y. Afeefy, Joel F. Liebman, and Stephen E. Stein
Individual Reactions
By formula: C8H16O2S2 + I2 = 2HI + C8H14O2S2
Quantity | Value | Units | Method | Reference | Comment |
---|---|---|---|---|---|
ΔrH° | -109.6 | kJ/mol | Cm | Sunner, 1955 | liquid phase; solvent: Ethanol/water(90/10) |

References

Sunner, 1955
Sunner, S.,
Strain in 6,8-thioctic acid,
Nature (London), 1955, 176, 217. [all data]