L-Phenylalanine, 2TBDMS derivative
- Formula: C21H39NO2Si2
- Molecular weight: 393.7109
- IUPAC Standard InChIKey: CCHAQKAMPRPVGP-GOSISDBHSA-N
- CAS Registry Number: 107715-95-7
- Chemical structure:
View 3d structure (requires JavaScript / HTML 5) - Other names: L-Phenylalanine, N-(tert-butyldimethylsilyl)-, tert-butyldimethylsilyl ester; N,O-Bis(dimethyl-t-butylsilyl)-l-phenylalanine; tert-Butyl(dimethyl)silyl 2-([tert-butyl(dimethyl)silyl]amino)-3-phenylpropanoate, (L)-; Phenylalanine, diTBDMS; Phenylalanine, N,O-bis-TBDMS; Phe, N,O-bis-TBDMS; Phe, TBDMS; Phenylalanine, TBDMS

Van Den Dool and Kratz RI, non-polar column, temperature ramp

Column type | Active phase | I | Reference | Comment |
---|---|---|---|---|
Capillary | DB-5 | 2098. | Ohie, Fu, et al., 2000 | 30. m/0.25 mm/0.25 μm, 100. C @ 1. min, 10. K/min, 300. C @ 15. min |
Capillary | DB-5 | 2098. | Ohie, Fu, et al., 2000 | 30. m/0.25 mm/0.25 μm, 100. C @ 1. min, 10. K/min, 300. C @ 15. min |

Van Den Dool and Kratz RI, non-polar column, custom temperature program

Column type | Active phase | I | Reference | Comment |
---|---|---|---|---|
Capillary | VF-5MS | 2091.2 | Tret'yakov, 2007 | 30. m/0.25 mm/0.25 μm, He; Program: Multi-step temperature program; T(initial)=60C; T(final)=270C |

Normal alkane RI, non-polar column, temperature ramp

Column type | Active phase | I | Reference | Comment |
---|---|---|---|---|
Capillary | DB-1 | 2094. | Tsunoda, 1993 | 30. m/0.24 mm/0.25 μm, He, 8. K/min, 300. C @ 5. min; Tstart: 100. C |

References

Ohie, Fu, et al., 2000
Ohie, T.; Fu, X.; Iga, M.; Kimura, M.; Yamaguchi, S.,
Gas chromatography-mass spectrometry with tert .-butyldimethylsilyl derivatization: use of the simplified sample preparations and the automated data system to screen for organic acidemias,
J. Chromatogr. B, 2000, 746, 1, 63-73, https://doi.org/10.1016/S0378-4347(00)00105-5
. [all data]
Tret'yakov, 2007
Tret'yakov, K.V.,
Retention Data. NIST Mass Spectrometry Data Center., NIST Mass Spectrometry Data Center, 2007. [all data]
Tsunoda, 1993
Tsunoda, N.,
Simultaneous determination of the herbicides glyphosate, glufosinate and bialaphos and their metabolites by capillary gas chromatography-ion-trap mass spectrometry,
J. Chromatogr., 1993, 637, 2, 167-173, https://doi.org/10.1016/0021-9673(93)83209-B
. [all data]