3,4,5-Trimethylbenzoic acid
- Formula: C10H12O2
- Molecular weight: 164.2011
- IUPAC Standard InChIKey: OWBVULKHVZHYPN-UHFFFAOYSA-N
- CAS Registry Number: 1076-88-6
- Chemical structure:
View 3d structure (requires JavaScript / HTML 5) - Permanent link for this species. Use this link for bookmarking this species for future reference.

Condensed phase thermochemistry data

Data compiled by: Hussein Y. Afeefy, Joel F. Liebman, and Stephen E. Stein
Quantity | Value | Units | Method | Reference | Comment |
---|---|---|---|---|---|
ΔfH°solid | -500.8 ± 1.8 | kJ/mol | Cm | Colomina, Jimenez, et al., 1987 | see Colomina, Turrion, et al., 1964 |
Quantity | Value | Units | Method | Reference | Comment |
ΔcH°solid | -5149.3 ± 0.92 | kJ/mol | Cm | Colomina, Jimenez, et al., 1987 | see Colomina, Turrion, et al., 1964; Corresponding ΔfHºsolid = -500.8 kJ/mol (simple calculation by NIST; no Washburn corrections) |

Gas phase ion energetics data

Data compiled by: John E. Bartmess

De-protonation reactions

C10H11O2- + Hydrogen cation = 3,4,5-Trimethylbenzoic acid

By formula: C10H11O2- + H+ = C10H12O2

Quantity Value Units Method Reference Comment
Δr1428. ± 9.2kJ/molG+TSDecouzon, Exner, et al., 1996gas phase
Quantity Value Units Method Reference Comment
Δr1398. ± 8.4kJ/molIMREDecouzon, Exner, et al., 1996gas phase

Gas phase thermochemistry data

Data compiled by: Hussein Y. Afeefy, Joel F. Liebman, and Stephen E. Stein

Quantity Value Units Method Reference Comment
Δfgas-93.16 ± 0.45kcal/molCmColomina, Jimenez, et al., 1987see Colomina, Turrion, et al., 1964

References

Colomina, Jimenez, et al., 1987
Colomina, M.; Jimenez, P.; Roux, M.V.; Turrion, C.,
Thermochemical properties of benzoic acid derivatives. XV. Vapour pressures and enthalpies of sublimation and formation of the six trimethylbenzoic acids,
J. Chem. Thermodyn., 1987, 19, 1139-1144. [all data]
Colomina, Turrion, et al., 1964
Colomina, M.; Turrion, C.; Boned, M.L.; Panea, M.,
Investigaciones termoquimicas sobre los acidos alquilbenzoicos. III. Acidos trimetilbenzoicos,
Anal. Fisc. Quim. B, 1964, 60, 619-626. [all data]