Trisiloxane, octamethyl-

Normal alkane RI, non-polar column, custom temperature program

View large format table.

Column type Active phase I Reference Comment
CapillaryUltra-11031.Kazuyoshi, Seiichi, et al., 200030. m/0.25 mm/0.50 μm; Program: 40 0C (5 min) 10 0C/min -> 200 0C 20 0C/min -> 320 0C (13 min)
CapillaryUltra-11031.Kazuyoshi, Seiichi, et al., 200030. m/0.25 mm/0.50 μm; Program: 40 0C (5 min) 10 0C/min -> 200 0C 20 0C/min -> 320 0C (13 min)
CapillaryUltra-11034.Kazuyoshi, Seiichi, et al., 200030. m/0.25 mm/0.50 μm; Program: 40 0C (5 min) 10 0C/min -> 200 0C 20 0C/min -> 320 0C (13 min)
CapillaryUltra-11034.Kazuyoshi, Seiichi, et al., 200030. m/0.25 mm/0.50 μm; Program: 40 0C (5 min) 10 0C/min -> 200 0C 20 0C/min -> 320 0C (13 min)
CapillaryUltra-11038.Kazuyoshi, Seiichi, et al., 200030. m/0.25 mm/0.50 μm; Program: 40 0C (5 min) 10 0C/min -> 200 0C 20 0C/min -> 320 0C (13 min)
CapillaryUltra-11038.Kazuyoshi, Seiichi, et al., 200030. m/0.25 mm/0.50 μm; Program: 40 0C (5 min) 10 0C/min -> 200 0C 20 0C/min -> 320 0C (13 min)

References

Kazuyoshi, Seiichi, et al., 2000
Kazuyoshi, N.; Seiichi, Y.; Kazuo, K.; Katsumi, I.; Okihiko, S., Polymer analysis by improved pyrolysis gas chromatography hyphenated with four specific detectors, J. Soc. Cosmet. Chem. Jpn., 2000, 34, 2, 142-151, https://doi.org/10.5107/sccj.34.142 . [all data]