Benzene, 1-methyl-3-propyl-
- Formula: C10H14
- Molecular weight: 134.2182
- IUPAC Standard InChIKey: QUEBYVKXYIKVSO-UHFFFAOYSA-N
- CAS Registry Number: 1074-43-7
- Chemical structure:
View 3d structure (requires JavaScript / HTML 5) - Other names: Toluene, m-propyl-; m-Propyltoluene; 1-Methyl-3-propylbenzene; 3-n-Propyltoluene; 1-Methyl-3-n-propylbenzene; 3-Propyl-toluene

Condensed phase thermochemistry data

Data compiled by: Hussein Y. Afeefy, Joel F. Liebman, and Stephen E. Stein
Quantity | Value | Units | Method | Reference | Comment |
---|---|---|---|---|---|
ΔfH°liquid | -76.2 ± 1.2 | kJ/mol | Ccb | Good, 1973 | |
ΔfH°liquid | -75.4 ± 2.2 | kJ/mol | Ccb | Prosen, Johnson, et al., 1946 | |
Quantity | Value | Units | Method | Reference | Comment |
ΔcH°liquid | -5859.7 ± 1.1 | kJ/mol | Ccb | Good, 1973 | Corresponding ΔfHºliquid = -76.23 kJ/mol (simple calculation by NIST; no Washburn corrections) |
ΔcH°liquid | -5860.6 ± 2.2 | kJ/mol | Ccb | Prosen, Johnson, et al., 1946 | Corresponding ΔfHºliquid = -75.31 kJ/mol (simple calculation by NIST; no Washburn corrections) |

Phase change data

Data compiled as indicated in comments:
BS - Robert L. Brown and Stephen E. Stein
TRC - Thermodynamics Research Center, NIST Boulder Laboratories, Chris Muzny director
AC - William E. Acree, Jr., James S. Chickos
Quantity | Value | Units | Method | Reference | Comment |
---|---|---|---|---|---|
Tboil | 454. ± 4. | K | AVG | N/A | Average of 11 values; Individual data points |
Quantity | Value | Units | Method | Reference | Comment |
Tfus | 190.570 | K | N/A | Streiff, Schultz, et al., 1960 | Uncertainty assigned by TRC = 0.02 K; TRC |
Quantity | Value | Units | Method | Reference | Comment |
ΔvapH° | 52.1 | kJ/mol | N/A | Reid, 1972 | AC |
Enthalpy of vaporization
ΔvapH (kJ/mol) | Temperature (K) | Method | Reference | Comment |
---|---|---|---|---|
47.8 | 349. | A | Stephenson and Malanowski, 1987 | Based on data from 334. to 485. K.; AC |

Kovats' RI, non-polar column, isothermal

Column type | Active phase | Temperature (C) | I | Reference | Comment |
---|---|---|---|---|---|
Capillary | CP Sil 2 | 80. | 1040.6 | Estel, Mohnke, et al., 1995 | 100. m/0.25 mm/0.25 μm |
Capillary | HP-1 | 60. | 1032. | Zhang, Li, et al., 1992 | N2; Column length: 25. m; Column diameter: 0.20 mm |
Capillary | HP-1 | 60. | 1032. | Zhang, Li, et al., 1992 | N2; Column length: 25. m; Column diameter: 0.20 mm |
Capillary | OV-101 | 100. | 1042. | Dimov and Mekenyan, 1989 | Column length: 50. m; Column diameter: 0.25 mm |
Capillary | OV-101 | 100. | 1042. | Matisová, Kovacicová, et al., 1989 | He; Column length: 50. m; Column diameter: 0.20 mm |
Capillary | OV-101 | 100. | 1042. | Matisová, Rukríglová, et al., 1988 | H2; Column length: 278. m; Column diameter: 0.25 mm |
Capillary | OV-101 | 100. | 1042. | Matisová, Rukríglová, et al., 1988 | H2; Column length: 278. m; Column diameter: 0.25 mm |
Capillary | OV-101 | 100. | 1043. | Matisová, Rukríglová, et al., 1988 | H2; Column length: 278. m; Column diameter: 0.25 mm |
Capillary | OV-101 | 100. | 1043. | Matisová, Rukríglová, et al., 1988 | H2; Column length: 278. m; Column diameter: 0.25 mm |
Capillary | Squalane | 100. | 1034. | Nabivach and Vasiliev, 1987 | |
Capillary | SE-30 | 70. | 1034.8 | Tóth, 1983 | N2; Column length: 15. m; Column diameter: 0.25 mm |
Capillary | OV-101 | 100. | 1043. | Gerasimenko and Nabivach, 1982 | N2; Column length: 50. m; Column diameter: 0.30 mm |
Capillary | OV-101 | 120. | 1048. | Gerasimenko and Nabivach, 1982 | N2; Column length: 50. m; Column diameter: 0.30 mm |
Capillary | OV-101 | 140. | 1054. | Gerasimenko and Nabivach, 1982 | N2; Column length: 50. m; Column diameter: 0.30 mm |
Capillary | Squalane | 86. | 1030.4 | Macák, Nabivach, et al., 1982 | N2; Column length: 50. m; Column diameter: 0.25 mm |
Capillary | Squalane | 96. | 1032.8 | Macák, Nabivach, et al., 1982 | N2; Column length: 50. m; Column diameter: 0.25 mm |
Capillary | OV-101 | 100. | 1043.4 | Gerasimenko, Kirilenko, et al., 1981 | N2; Column length: 50. m; Column diameter: 0.3 mm |
Capillary | OV-101 | 120. | 1048.2 | Gerasimenko, Kirilenko, et al., 1981 | N2; Column length: 50. m; Column diameter: 0.3 mm |
Capillary | OV-101 | 140. | 1054.4 | Gerasimenko, Kirilenko, et al., 1981 | N2; Column length: 50. m; Column diameter: 0.3 mm |
Capillary | SE-30 | 65. | 1031.6 | Kuchhal, Kumar, et al., 1980 | |
Capillary | Squalane | 80. | 1027.8 | Kuchhal, Kumar, et al., 1980 | Column length: 45.7 m; Column diameter: 0.25 mm |
Capillary | Squalane | 86. | 1030.4 | Nabivach, Bur'yan, et al., 1978 | Column length: 50. m; Column diameter: 0.25 mm |
Capillary | Squalane | 96. | 1032.8 | Nabivach, Bur'yan, et al., 1978 | Column length: 50. m; Column diameter: 0.25 mm |
Capillary | Squalane | 80. | 1027.78 | Soják and Rijks, 1976 | H2; Column length: 100. m; Column diameter: 0.25 mm |
Packed | SE-30 | 110. | 1051. | Mitra, Mohan, et al., 1974 | N2, Chrom W; Column length: 6.1 m |
Packed | SE-30 | 120. | 1056. | Mitra, Mohan, et al., 1974 | N2, Chrom W; Column length: 6.1 m |
Packed | SE-30 | 130. | 1059. | Mitra, Mohan, et al., 1974 | N2, Chrom W; Column length: 6.1 m |
Capillary | SE-30 | 130. | 1057. | Mitra, Mohan, et al., 1974, 2 | H2; Column length: 6.1 m; Column diameter: 3.18 mm |
Capillary | SE-30 | 140. | 1060. | Mitra, Mohan, et al., 1974, 2 | H2; Column length: 6.1 m; Column diameter: 3.18 mm |
Capillary | SE-30 | 150. | 1062. | Mitra, Mohan, et al., 1974, 2 | H2; Column length: 6.1 m; Column diameter: 3.18 mm |
Capillary | SE-30 | 160. | 1063. | Mitra, Mohan, et al., 1974, 2 | H2; Column length: 6.1 m; Column diameter: 3.18 mm |
Capillary | SE-30 | 170. | 1066. | Mitra, Mohan, et al., 1974, 2 | H2; Column length: 6.1 m; Column diameter: 3.18 mm |
Capillary | Squalane | 100. | 1032. | Mitra, Mohan, et al., 1974, 2 | H2; Column length: 50. m; Column diameter: 0.2 mm |
Capillary | SE-30 | 65. | 1031.6 | Svob and Deur-Siftar, 1974 | He; Column length: 25.5 m; Column diameter: 0.5 mm |
Capillary | Squalane | 100. | 1033.4 | Svob and Deur-Siftar, 1974 | He; Column length: 10.5 m; Column diameter: 0.25 mm |
Capillary | Squalane | 92. | 1033. | Krupcík, Liska, et al., 1970 | N2; Column length: 45. m; Column diameter: 0.2 mm |
Capillary | Squalane | 115. | 1037.0 | Krupcík, Liska, et al., 1970 | N2; Column length: 200. m; Column diameter: 0.2 mm |
Capillary | Squalane | 115. | 1037.1 | Soják and Bucinská, 1970 | N2; Column length: 200. m; Column diameter: 0.2 mm |
Capillary | Squalane | 86. | 1030.5 | Soják and Bucinská, 1970 | N2; Column length: 200. m; Column diameter: 0.2 mm |

Kovats' RI, non-polar column, temperature ramp

Column type | Active phase | I | Reference | Comment |
---|---|---|---|---|
Capillary | DB-5 | 1065.3 | Wang, Fingas, et al., 1994 | 30. m/0.32 mm/0.25 μm, He, 50. C @ 2. min, 6. K/min; Tend: 300. C |
Capillary | OV-101 | 1036. | Hayes and Pitzer, 1982 | 110. m/0.25 mm/0.20 μm, He, 1. K/min; Tstart: 35. C; Tend: 200. C |
Capillary | Apiezon L | 1060. | Louis, 1971 | N2, 1. K/min; Column length: 50. m; Column diameter: 0.25 mm; Tstart: 60. C |

Kovats' RI, non-polar column, custom temperature program

Column type | Active phase | I | Reference | Comment |
---|---|---|---|---|
Capillary | Petrocol DH-100 | 1042.5 | Haagen-Smit Laboratory, 1997 | He; Column length: 100. m; Column diameter: 0.2 mm; Program: 5C(10min) => 5C/min => 50C(48min) => 1.5C/min => 195C(91min) |
Capillary | DB-1 | 1042. | Hoekman, 1993 | 60. m/0.32 mm/1.0 μm, He; Program: -40 C for 12 min; -40 - 125 C at 3 deg.min; 125-185 C at 6 deg/min; 185 - 220 C at 20 deg/min; hold 220 C for 2 min |
Capillary | Squalane | 1036. | Papazova and Pankova, 1975 | N2; Column length: 100. m; Column diameter: 0.25 mm; Program: not specified |
Capillary | Squalane | 1041. | Papazova and Pankova, 1975 | N2; Column length: 100. m; Column diameter: 0.25 mm; Program: not specified |

Kovats' RI, polar column, isothermal

Column type | Active phase | Temperature (C) | I | Reference | Comment |
---|---|---|---|---|---|
Capillary | Carbowax 20M | 150. | 1259. | Egazaryants and Maximov, 1998 | He; Column length: 15. m; Column diameter: 0.5 mm |
Capillary | Carbowax 20M | 150. | 1262. | Egazaryants and Maximov, 1998 | He; Column length: 15. m; Column diameter: 0.5 mm |
Capillary | PEG-20M | 70. | 1301.0 | Tóth, 1983 | N2; Column length: 30. m; Column diameter: 0.3 mm |
Capillary | Carbowax 20M | 90. | 1277.2 | Kuchhal, Kumar, et al., 1980 | |
Capillary | Carbowax 20M | 90. | 1277.2 | Döring, Estel, et al., 1974 | Column length: 100. m; Column diameter: 0.2 mm |

Van Den Dool and Kratz RI, non-polar column, temperature ramp

Column type | Active phase | I | Reference | Comment |
---|---|---|---|---|
Capillary | HP-5MS | 1052. | Kallio, Jussila, et al., 2006 | 20. m/0.25 mm/0.25 μm, 60. C @ 4. min, 5. K/min, 240. C @ 15. min |
Capillary | Petrocol DH | 1042.9 | Censullo, Jones, et al., 2003 | 50. m/0.25 mm/0.5 μm, He, 35. C @ 10. min, 3. K/min, 200. C @ 10. min |
Capillary | DB-5 | 1058.2 | Xu, van Stee, et al., 2003 | 30. m/0.25 mm/1. μm, He, 2.5 K/min; Tstart: 50. C; Tend: 200. C |
Capillary | OV-101 | 1036.5 | Yin, Liu, et al., 2001 | N2, 1. K/min; Column length: 80. m; Column diameter: 0.22 mm; Tstart: 30. C; Tend: 130. C |
Capillary | PONA | 1034.5 | Martos, Saraullo, et al., 1997 | 50. m/0.2 mm/0.5 μm, 35. C @ 0.5 min, 1. K/min, 220. C @ 8. min |
Capillary | PONA | 1037.5 | Martos, Saraullo, et al., 1997 | 50. m/0.2 mm/0.5 μm, 35. C @ 0.5 min, 1. K/min, 220. C @ 8. min |
Capillary | Ultra-1 | 1037. | Olson, Sinkevitch, et al., 1992 | 4. K/min; Tstart: -40. C; Tend: 230. C |
Capillary | Petrocol DH | 1037.02 | White, Douglas, et al., 1992 | 100. m/0.25 mm/0.5 μm, He, 1. K/min; Tstart: 30. C; Tend: 220. C |
Capillary | Petrocol DH | 1037.76 | White, Douglas, et al., 1992 | 100. m/0.25 mm/0.5 μm, He, 1. K/min; Tstart: 30. C; Tend: 220. C |
Capillary | Petrocol DH | 1038. | White, Hackett, et al., 1992 | 100. m/0.25 mm/0.5 μm, He, 1. K/min; Tstart: 30. C; Tend: 220. C |
Capillary | Ultra-1 | 1037.58 | Steward and Pitzer, 1988 | 50. m/0.2 mm/0.33 μm, He, 2. K/min; Tstart: 0. C; Tend: 240. C |
Capillary | OV-101 | 1036. | Hayes and Pitzer, 1981 | 108. m/0.25 mm/0.2 μm, 1. K/min; Tstart: 35. C; Tend: 200. C |

Van Den Dool and Kratz RI, non-polar column, custom temperature program

Column type | Active phase | I | Reference | Comment |
---|---|---|---|---|
Capillary | Methyl Silicone | 1057.61 | Hassoun, Pilling, et al., 1999 | 50. m/0.25 mm/1. μm, He; Program: -50C(2min) => 49.9C/min => 35C(10min) => 3C/min => 200C(2min) => 40C/min => 240C(30min) |

Van Den Dool and Kratz RI, polar column, temperature ramp

Column type | Active phase | I | Reference | Comment |
---|---|---|---|---|
Capillary | CP-Wax 52CB | 1297. | Alasalvar, Taylor, et al., 2005 | 60. m/0.25 mm/0.25 μm, 35. C @ 4. min, 3. K/min; Tend: 203. C |

Normal alkane RI, non-polar column, isothermal

Column type | Active phase | Temperature (C) | I | Reference | Comment |
---|---|---|---|---|---|
Capillary | Methyl Silicone | 120. | 1043. | Chen and Feng, 2006 | |
Capillary | Methyl Silicone | 120. | 1054. | Chen and Feng, 2006 | |
Capillary | OV-101 | 100. | 1043. | Tian, 1993 | Column length: 50. m; Column diameter: 0.20 mm |
Capillary | OV-101 | 100. | 1043. | Tian, 1993 | Column length: 50. m; Column diameter: 0.20 mm |
Capillary | OV-101 | 120. | 1048. | Tian, 1993 | Column length: 50. m; Column diameter: 0.20 mm |
Capillary | OV-101 | 120. | 1048. | Tian, 1993 | Column length: 50. m; Column diameter: 0.20 mm |
Capillary | Squalane | 95.4 | 1024. | Sojak and Vigdergauz, 1978 | H2 |
Capillary | Squalane | 110. | 1036. | Papazova and Pankova, 1975 | N2; Column length: 100. m; Column diameter: 0.25 mm |
Capillary | Squalane | 130. | 1041. | Papazova and Pankova, 1975 | N2; Column length: 100. m; Column diameter: 0.25 mm |

Normal alkane RI, non-polar column, temperature ramp

Column type | Active phase | I | Reference | Comment |
---|---|---|---|---|
Capillary | Polydimethyl siloxane: CP-Sil 5 CB | 1003. | Bramston-Cook, 2013 | 60. m/0.25 mm/1.0 μm, Helium, 45. C @ 1.45 min, 3.6 K/min, 210. C @ 2.72 min |
Capillary | Polydimethyl siloxane: CP-Sil 5 CB | 1042. | Bramston-Cook, 2013 | 60. m/0.25 mm/1.0 μm, Helium, 45. C @ 1.45 min, 3.6 K/min, 210. C @ 2.72 min |
Capillary | HP-5 MS | 1049. | Kotowska, Zalikowski, et al., 2012 | 30. m/0.25 mm/0.25 μm, Helium, 35. C @ 5. min, 3. K/min, 300. C @ 15. min |
Capillary | Petrocol DH | 1042. | Supelco, 2012 | 100. m/0.25 mm/0.50 μm, Helium, 20. C @ 15. min, 15. K/min, 220. C @ 30. min |
Capillary | VF-5 MS | 1051. | Leffingwell and Alford, 2011 | 60. m/0.32 mm/0.25 μm, Helium, 2. K/min, 260. C @ 28. min; Tstart: 30. C |
Capillary | VF-5 MS | 1054. | Leffingwell and Alford, 2011 | 60. m/0.32 mm/0.25 μm, Helium, 2. K/min, 260. C @ 28. min; Tstart: 30. C |
Capillary | PONA | 1044. | Zhang, Ding, et al., 2009 | 50. m/0.20 mm/0.50 μm, Nitrogen, 35. C @ 15. min, 2. K/min, 200. C @ 10. min |
Capillary | OV-1 | 1039. | Orav, Kailas, et al., 1999 | 2. K/min; Tstart: 50. C; Tend: 160. C |
Capillary | HP-5 | 1058.1 | Wang and Fingas, 1995 | 30. m/0.25 mm/0.25 μm, He, 35. C @ 2. min, 10. K/min, 300. C @ 10. min |
Capillary | DB-1 | 1039. | Ciccioli, Cecinato, et al., 1992 | 60. m/0.32 mm/1.2 μm, He, 30. C @ 10. min, 3. K/min; Tend: 240. C |
Capillary | CP Sil 5 CB | 1034. | Hartgers, Damste, et al., 1992 | 25. m/0.32 mm/0.45 μm, He, 0. C @ 5. min, 3. K/min, 320. C @ 10. min |
Capillary | OV-101 | 1036. | Zenkevich and Ventura, 1991 | Helium, 50. C @ 0. min, 5. K/min, 240. C @ 0. min; Column length: 54. m; Column diameter: 0.26 mm |
Capillary | OV-101 | 1042. | Matisová, Kovacicová, et al., 1989 | He, 1. K/min; Column length: 50. m; Column diameter: 0.20 mm; Tstart: 80. C; Tend: 190. C |

Normal alkane RI, non-polar column, custom temperature program

Column type | Active phase | I | Reference | Comment |
---|---|---|---|---|
Capillary | HP-5 MS | 1055. | Kotowska, Zalikowski, et al., 2012 | 30. m/0.25 mm/0.25 μm, Helium; Program: not specified |
Capillary | DB-5 MS | 1059. | Cajka, Hajslova, et al., 2007 | 30. m/0.25 mm/0.25 μm, Helium; Program: 45 0C (0.75 min) 10 0C/min -> 200 0C 30 0C/min -> 245 0C (1.25 min) |
Capillary | Methyl Silicone | 1049. | Blunden, Aneja, et al., 2005 | 60. m/0.32 mm/1.0 μm, Helium; Program: -50 0C (2 min) 8 0C/min -> 200 0C (7.75 min) 25 0C -> 225 0C (8 min) |
Capillary | Polymethylsiloxane, (PMS-20000) | 1035. | Cornwell and Cordano, 2003 | Program: not specified |
Capillary | Methyl Silicone | 1043. | Spieksma, 1999 | Program: not specified |
Capillary | SE-30 | 1035. | Xiuhua, Zhang, et al., 1996 | Program: not specified |
Capillary | SE-30 | 1042. | Xiuhua, Zhang, et al., 1996 | Program: not specified |
Capillary | SE-30 | 1043. | Xiuhua, Zhang, et al., 1996 | Program: not specified |
Capillary | OV-101 | 1042. | Dimov, Osman, et al., 1994 | Program: not specified |
Capillary | OV-101 | 1042. | Matisová, Juranyiová, et al., 1991 | 52. m/0.25 mm/0.38 μm, H2; Program: 70 - 160 C at 1.5 deg/min; 160 - 280 C at 15 deg/min 15 min at 280 C |
Capillary | Squalane | 1034. | Dimov and Mekenyan, 1989 | Program: not specified |
Capillary | OV-1, SE-30, Methyl silicone, SP-2100, OV-101, DB-1, etc. | 1032. | Waggott and Davies, 1984 | Hydrogen; Column length: 50. m; Column diameter: 0.32 mm; Program: not specified |

Normal alkane RI, polar column, isothermal

Column type | Active phase | Temperature (C) | I | Reference | Comment |
---|---|---|---|---|---|
Capillary | PEG-40M | 100. | 1314. | Nesterov, Nesterova, et al., 2000 | Column length: 50. m |
Capillary | PEG-40M | 100. | 1315. | Nesterov, Nesterova, et al., 2000 | Column length: 50. m |
Capillary | PEG-40M | 120. | 1326. | Nesterov, Nesterova, et al., 2000 | Column length: 50. m |
Capillary | PEG-40M | 140. | 1338. | Nesterov, Nesterova, et al., 2000 | Column length: 50. m |
Capillary | PEG-40M | 160. | 1354. | Nesterov, Nesterova, et al., 2000 | Column length: 50. m |
Capillary | PEG-40M | 80. | 1302. | Nesterov, Nesterova, et al., 2000 | Column length: 50. m |
Capillary | Carbowax 20M | 90. | 1277. | Sutter, Peterson, et al., 1997 |

Normal alkane RI, polar column, custom temperature program

Column type | Active phase | I | Reference | Comment |
---|---|---|---|---|
Capillary | Carbowax 20M | 1301. | Cornwell and Cordano, 2003 | Program: not specified |
Capillary | Carbowax 20M | 1277. | Ivanciuc, Ivanciuc, et al., 2001 | Program: not specified |
Capillary | Carbowax 20M | 1284. | Dimov and Mekenyan, 1989 | Program: not specified |

References

Good, 1973
Good, W.D.,
The enthalpies of combustion and formation of n-butylbenzene, the diethylbenzenes, the methyl-n-propylbenzenes, and the methyl-iso-propylbenzenes,
J. Chem. Thermodyn., 1973, 5, 707-714. [all data]
Prosen, Johnson, et al., 1946
Prosen, E.J.; Johnson, W.H.; Rossini, F.D.,
Heats of combustion and formation at 25°C of the alkylbenzenes through C10H14, and of the higher normal monoalkylbenzenes,
J. Res. NBS, 1946, 36, 455-461. [all data]
Streiff, Schultz, et al., 1960
Streiff, A.J.; Schultz, L.H.; Krouskop, N.C.; Moore, J.W.; Rossini, F.D.,
Purification, Purity, and Freezing Points of 16 API Standard and API Research Hydrocarbons,
J. Chem. Eng. Data, 1960, 5, 193-5. [all data]
Reid, 1972
Reid, Robert C.,
Handbook on vapor pressure and heats of vaporization of hydrocarbons and related compounds, R. C. Wilhort and B. J. Zwolinski, Texas A Research Foundation. College Station, Texas(1971). 329 pages.$10.00,
AIChE J., 1972, 18, 6, 1278-1278, https://doi.org/10.1002/aic.690180637
. [all data]
Stephenson and Malanowski, 1987
Stephenson, Richard M.; Malanowski, Stanislaw,
Handbook of the Thermodynamics of Organic Compounds, 1987, https://doi.org/10.1007/978-94-009-3173-2
. [all data]