Phenyltrichlorogermane
- Formula: C6H5Cl3Ge
- Molecular weight: 256.10
- IUPAC Standard InChIKey: CIWQSBMDFPABPQ-UHFFFAOYSA-N
- CAS Registry Number: 1074-29-9
- Chemical structure:

Phase change data

Data compiled by: William E. Acree, Jr., James S. Chickos
Enthalpy of vaporization
ΔvapH (kJ/mol) | Temperature (K) | Reference | Comment |
---|---|---|---|
55.4 | 358. | Sokolov, Karapet'yants, et al., 1972 | Based on data from 343. to 473. K. |

References

Sokolov, Karapet'yants, et al., 1972
Sokolov, V.B.; Karapet'yants, M.Kh.; Kolesnikov, S.P.; Perl'mutter, B.L.; Nefedov, O.M.,
Tr. Mosk. Khim. Tekhnol. Inst., 1972, 71, 6. [all data]