Phenol, 4-(methylthio)-
- Formula: C7H8OS
- Molecular weight: 140.203
- IUPAC Standard InChIKey: QASBCTGZKABPKX-UHFFFAOYSA-N
- CAS Registry Number: 1073-72-9
- Chemical structure:
View 3d structure (requires JavaScript / HTML 5) - Other names: Phenol, p-(methylthio)-; p-(Methylthio)phenol; 4-(Methylthio)phenol; 4-Hydroxyphenyl methyl sulfide; Methyl 4-hydroxyphenyl sulfide; p-Hydroxyphenyl methyl sulfide; p-Hydroxythioanisole; NSC 75840; Phenol, p-methylmercapto-; 4-Methylsulfanylphenol; 4-(Methylmercapto)phenol

Phase change data

Data compiled by: Robert L. Brown and Stephen E. Stein
Reduced pressure boiling point
Tboil (K) | Pressure (bar) | Reference |
---|---|---|
427.7 | 0.027 | Aldrich Chemical Company Inc., 1990 |

Van Den Dool and Kratz RI, non-polar column, custom temperature program

Column type | Active phase | I | Reference | Comment |
---|---|---|---|---|
Capillary | VF-5MS | 1416.3 | Tret'yakov, 2008 | 30. m/0.25 mm/0.25 μm, He; Program: Multi-step temperature program; T(initial)=60C; T(final)=270C |

References

Aldrich Chemical Company Inc., 1990
Aldrich Chemical Company Inc.,
Catalog Handbook of Fine Chemicals, Aldrich Chemical Company, Inc., Milwaukee WI, 1990, 1. [all data]
Tret'yakov, 2008
Tret'yakov, K.V.,
Retention Data. NIST Mass Spectrometry Data Center., NIST Mass Spectrometry Data Center, 2008. [all data]