Benzene, 1-chloro-4-ethenyl-
- Formula: C8H7Cl
- Molecular weight: 138.594
- IUPAC Standard InChIKey: KTZVZZJJVJQZHV-UHFFFAOYSA-N
- CAS Registry Number: 1073-67-2
- Chemical structure:
View 3d structure (requires JavaScript / HTML 5) - Other names: Styrene, p-chloro-; p-Chlorostyrene; 4-Chlorostyrene; Parachlorostyrene; Benzene, 4-chloro-1-ethenyl-; 1-Chloro-4-vinylbenzene

Phase change data

Data compiled as indicated in comments:
BS - Robert L. Brown and Stephen E. Stein
AC - William E. Acree, Jr., James S. Chickos
Quantity | Value | Units | Method | Reference | Comment |
---|---|---|---|---|---|
Tboil | 465.2 | K | N/A | Weast and Grasselli, 1989 | BS |
Reduced pressure boiling point
Tboil (K) | Pressure (bar) | Reference | Comment |
---|---|---|---|
339.5 | 0.013 | Weast and Grasselli, 1989 | BS |
Enthalpy of vaporization
ΔvapH (kJ/mol) | Temperature (K) | Method | Reference | Comment |
---|---|---|---|---|
48.1 | 378. | A | Stephenson and Malanowski, 1987 | Based on data from 363. to 523. K. See also Stull, 1947 and Dykyj and Vanko, 1970.; AC |

Kovats' RI, polar column, isothermal

Column type | Active phase | Temperature (C) | I | Reference | Comment |
---|---|---|---|---|---|
Capillary | Carbowax 20M | 110. | 1537.8 | Boneva and Vassilev, 1996 | 50. m/0.32 mm/0.3 μm, N2 |
Capillary | Carbowax 20M | 120. | 1534.7 | Boneva and Vassilev, 1996 | 50. m/0.32 mm/0.3 μm, N2 |

Van Den Dool and Kratz RI, non-polar column, temperature ramp

Column type | Active phase | I | Reference | Comment |
---|---|---|---|---|
Capillary | DB-1 | 1043.7 | Sun and Stremple, 2003 | 30. m/0.25 mm/0.25 μm, He, 3. K/min; Tstart: 40. C; Tend: 325. C |

References

Weast and Grasselli, 1989
CRC Handbook of Data on Organic Compounds, 2nd Editon, Weast,R.C and Grasselli, J.G., ed(s)., CRC Press, Inc., Boca Raton, FL, 1989, 1. [all data]
Stephenson and Malanowski, 1987
Stephenson, Richard M.; Malanowski, Stanislaw,
Handbook of the Thermodynamics of Organic Compounds, 1987, https://doi.org/10.1007/978-94-009-3173-2
. [all data]
Stull, 1947
Stull, Daniel R.,
Vapor Pressure of Pure Substances. Organic and Inorganic Compounds,
Ind. Eng. Chem., 1947, 39, 4, 517-540, https://doi.org/10.1021/ie50448a022
. [all data]
Dykyj and Vanko, 1970
Dykyj, J.; Vanko, A.,
Petrochemica, 1970, 10, 1, 3. [all data]
Boneva and Vassilev, 1996
Boneva, S.; Vassilev, K.,
Gas chromatographic separation of epoxystyrenes on carbowax 20 M capillary column,
Chromatographia, 1996, 43, 3/4, 208-210, https://doi.org/10.1007/BF02292953
. [all data]
Sun and Stremple, 2003
Sun, G.; Stremple, P.,
Retention index characterization of flavor, fragrance, and many other compounds on DB-1 and DB-XLB, 2003, retrieved from http://www.chem.agilent.com/cag/cabu/pdf/b-0279.pdf. [all data]