Phenol, 2-(methylthio)-
- Formula: C7H8OS
- Molecular weight: 140.203
- IUPAC Standard InChIKey: SOOARYARZPXNAL-UHFFFAOYSA-N
- CAS Registry Number: 1073-29-6
- Chemical structure:
View 3d structure (requires JavaScript / HTML 5) - Other names: Phenol, o-(methylthio)-; o-(Methylthio)phenol; o-Hydroxythioanisole; 2-(Methylthio)phenol; 2-(Methylmercapto)phenol; 2-(Methylsulfanyl)phenol

Phase change data

Data compiled by: Robert L. Brown and Stephen E. Stein
Reduced pressure boiling point
Tboil (K) | Pressure (bar) | Reference |
---|---|---|
376.7 | 0.028 | Aldrich Chemical Company Inc., 1990 |

Kovats' RI, non-polar column, isothermal

Column type | Active phase | Temperature (C) | I | Reference | Comment |
---|---|---|---|---|---|
Packed | Apiezon M | 130. | 1111. | Garbuzov, Misharina, et al., 1985 | He or N2, Chromosorb W, AW-DMCS; Column length: 2.1 m |
Packed | Apiezon M | 130. | 1111. | Golovnya, Garbuzov, et al., 1978 | Chromosorb W, AW/DMS; Column length: 2.1 m |

Van Den Dool and Kratz RI, non-polar column, custom temperature program

Column type | Active phase | I | Reference | Comment |
---|---|---|---|---|
Capillary | VF-5MS | 1190.6 | Tret'yakov, 2008 | 30. m/0.25 mm/0.25 μm, He; Program: Multi-step temperature program; T(initial)=60C; T(final)=270C |

Normal alkane RI, non-polar column, custom temperature program

Column type | Active phase | I | Reference | Comment |
---|---|---|---|---|
Capillary | SPB-5 | 1175. | Begnaud, Pérès, et al., 2003 | 60. m/0.32 mm/1. μm; Program: not specified |

References

Aldrich Chemical Company Inc., 1990
Aldrich Chemical Company Inc.,
Catalog Handbook of Fine Chemicals, Aldrich Chemical Company, Inc., Milwaukee WI, 1990, 1. [all data]
Garbuzov, Misharina, et al., 1985
Garbuzov, V.G.; Misharina, T.A.; Aerov, A.F.; Golovnya, R.V.,
Gas chromatographic retention indices for sulphur(II)-containing organic substances,
J. Anal. Chem. USSR (Engl. Transl.), 1985, 40, 4, 576-586. [all data]
Golovnya, Garbuzov, et al., 1978
Golovnya, R.V.; Garbuzov, V.G.; Aerov, A.F.,
Gas chromatographic characterization of sulfur-containing compounds. 5. Thiophene, furan, and benzene derivatives,
Izv. Akad. Nauk SSSR Ser. Khim., 1978, 11, 2271-2274. [all data]
Tret'yakov, 2008
Tret'yakov, K.V.,
Retention Data. NIST Mass Spectrometry Data Center., NIST Mass Spectrometry Data Center, 2008. [all data]
Begnaud, Pérès, et al., 2003
Begnaud, F.; Pérès, C.; Berdagué, J.-L.,
Characterization of volatile effluents of livestock buildings by solid-phase microextraction,
Int. J. Environ. Anal. Chem., 2003, 83, 10, 837-849, https://doi.org/10.1080/03067310310001603349
. [all data]