2-Butene, 2-(ethylthio)-, (Z)-

Reaction thermochemistry data

Data compiled by: Hussein Y. Afeefy, Joel F. Liebman, and Stephen E. Stein

Individual Reactions

2-(Ethylthio)-1-butene = 2-Butene, 2-(ethylthio)-, (Z)-

By formula: C6H12S = C6H12S

Quantity Value Units Method Reference Comment
Δr-5.4 ± 0.2kJ/molEqkKimmelma and Taskinen, 1987liquid phase; solvent: THF; Isomerization

trans-1-(Ethylthio)-2-butene = 2-Butene, 2-(ethylthio)-, (Z)-

By formula: C6H12S = C6H12S

Quantity Value Units Method Reference Comment
Δr3.6 ± 0.3kJ/molEqkKimmelma, 1987liquid phase; solvent: DMSO

References

Kimmelma and Taskinen, 1987
Kimmelma, R.; Taskinen, E., Structure-stability relationships in vinyl sulfides. II. Stabilization energies due to alkyl and alkylthio groups attached to the β carbon of vinyl sulfides and vinyl ethers, Acta Chem. Scand., 1987, 41, 271-277. [all data]

Kimmelma, 1987
Kimmelma, R., The stabilization due to the methyl group in RSCH2CH=CHCH3, Acta Chem. Scand., 1987, 41, 344-347. [all data]