2-Cyclohexen-1-one, 4,4-dimethyl-
- Formula: C8H12O
- Molecular weight: 124.1803
- IUPAC Standard InChIKey: HAUNPYVLVAIUOO-UHFFFAOYSA-N
- CAS Registry Number: 1073-13-8
- Chemical structure:
View 3d structure (requires JavaScript / HTML 5) - Other names: 4,4-Dimethyl-2-cyclohexen-1-one; 4,4-Dimethyl-2-cyclohexenone; 4,4-Dimethylcyclohexenone

Phase change data

Data compiled by: Robert L. Brown and Stephen E. Stein
Reduced pressure boiling point
Tboil (K) | Pressure (bar) | Reference |
---|---|---|
346.0 | 0.027 | Aldrich Chemical Company Inc., 1990 |

Reaction thermochemistry data

Data compiled by: John E. Bartmess
Individual Reactions
C8H11O- + =
By formula: C8H11O- + H+ = C8H12O
Quantity | Value | Units | Method | Reference | Comment |
---|---|---|---|---|---|
ΔrH° | 1529. ± 8.8 | kJ/mol | G+TS | Bartmess and Kiplinger, 1986 | gas phase; value altered from reference due to change in acidity scale |
Quantity | Value | Units | Method | Reference | Comment |
ΔrG° | 1497. ± 8.4 | kJ/mol | IMRE | Bartmess and Kiplinger, 1986 | gas phase; value altered from reference due to change in acidity scale |

Gas phase ion energetics data

Data compiled by: John E. Bartmess
De-protonation reactions
C8H11O- + =
By formula: C8H11O- + H+ = C8H12O
Quantity | Value | Units | Method | Reference | Comment |
---|---|---|---|---|---|
ΔrH° | 1529. ± 8.8 | kJ/mol | G+TS | Bartmess and Kiplinger, 1986 | gas phase; value altered from reference due to change in acidity scale |
Quantity | Value | Units | Method | Reference | Comment |
ΔrG° | 1497. ± 8.4 | kJ/mol | IMRE | Bartmess and Kiplinger, 1986 | gas phase; value altered from reference due to change in acidity scale |

Normal alkane RI, polar column, temperature ramp

Column type | Active phase | I | Reference | Comment |
---|---|---|---|---|
Capillary | DB-Wax | 1651. | Souza, Re-Poppi, et al., 2012 | 30. m/0.25 mm/0.25 μm, Helium, 60. C @ 1. min, 5. K/min; Tend: 240. C |

References

Aldrich Chemical Company Inc., 1990
Aldrich Chemical Company Inc.,
Catalog Handbook of Fine Chemicals, Aldrich Chemical Company, Inc., Milwaukee WI, 1990, 1. [all data]
Bartmess and Kiplinger, 1986
Bartmess, J.E.; Kiplinger, J.P.,
'Kinetic' vs. thermodynamic acidities of enones in the gas phase,
J. Org. Chem., 1986, 51, 2173. [all data]
Souza, Re-Poppi, et al., 2012
Souza, J.B.G.; Re-Poppi, N.; Raposo, J.L.(Jr).,
Characterization of pyroligneous acid used in agriculture by gas chromatography - mass spectrometry (in press),
J. Braz. Chem. Soc., 2012, 00, 00, 1-8. [all data]