Ethanone, 1-(1H-pyrrol-2-yl)-
- Formula: C6H7NO
- Molecular weight: 109.1259
- IUPAC Standard InChIKey: IGJQUJNPMOYEJY-UHFFFAOYSA-N
- CAS Registry Number: 1072-83-9
- Chemical structure:
View 3d structure (requires JavaScript / HTML 5) - Other names: Ketone, methyl pyrrol-2-yl; Methyl pyrrol-2-yl ketone; 2-Acetylpyrrole; Pyrrole-α-methyl ketone; 1-(1H-pyrrol-2-yl)1-ethanone; 1-(1H-pyrrole-2-yl)-ethanone; 1H-Pyrrole, 2-acetyl; 2-Acetyl-1H-pyrrole; Ethanone, 1-(1H-pyrrole-2-yl)-; Pyrrole, 2-acetyl; 1-(1H-Pyrrol-2-yl)ethanone; 2-Pyrrolyl methyl ketone; 1-(1H-pyrrol-2-yl)ethanone (acetylpyrrole); 2-Acetylpyrrol; 1-(1H-pyrrol-2-yl)ethan-1-one

Phase change data

Data compiled as indicated in comments:
BS - Robert L. Brown and Stephen E. Stein
TRC - Thermodynamics Research Center, NIST Boulder Laboratories, Chris Muzny director
AC - William E. Acree, Jr., James S. Chickos
Quantity | Value | Units | Method | Reference | Comment |
---|---|---|---|---|---|
Tboil | 493.2 | K | N/A | Weast and Grasselli, 1989 | BS |
Tboil | 493. | K | N/A | Buckingham and Donaghy, 1982 | BS |
Quantity | Value | Units | Method | Reference | Comment |
Tfus | 363. | K | N/A | Buckingham and Donaghy, 1982 | BS |
Tfus | 363. | K | N/A | Cumper and Wood, 1971 | Uncertainty assigned by TRC = 3. K; TRC |
Quantity | Value | Units | Method | Reference | Comment |
ΔsubH° | 81.2 ± 1.0 | kJ/mol | ME | Santos, Gomes, et al., 2009 | Based on data from 277. to 293. K.; AC |
Enthalpy of sublimation
ΔsubH (kJ/mol) | Temperature (K) | Method | Reference | Comment |
---|---|---|---|---|
81.3 ± 1.0 | 285. | ME | Santos, Gomes, et al., 2009 | Based on data from 277. to 293. K.; AC |
Enthalpy of fusion
ΔfusH (kJ/mol) | Temperature (K) | Reference | Comment |
---|---|---|---|
14.08 | 363. | Flores, Adriana Camarillo, et al., 2009 | AC |

Normal alkane RI, polar column, temperature ramp

Data compiled by: NIST Mass Spectrometry Data Center, William E. Wallace, director

Column type CapillaryCapillaryCapillaryCapillaryCapillary
Active phase HP-FFAPHP-FFAPHP-FFAPHP-InnowaxDB-Wax
Column length (m) 25.25.25.15.60.
Carrier gas HeliumHeliumHeliumHeliumHelium
Substrate
Column diameter (mm) 0.320.320.320.320.25
Phase thickness (μm) 0.500.500.500.500.50
Tstart (C) 45.45.45.40.40.
Tend (C) 220.220.220.250.210.
Heat rate (K/min) 15.15.15.3.2.
Initial hold (min)     5.
Final hold (min)     70.
I 2006.2003.2008.1967.2006.
ReferenceWanakhachornkrai and Lertsiri, 9999Wanakhachornkrai and Lertsiri, 9999Wanakhachornkrai and Lertsiri, 9999Puvipirom and Chaisei, 2012Moon and Shibamoto, 2010
Comment MSDC-RI MSDC-RI MSDC-RI MSDC-RI MSDC-RI
Column type CapillaryCapillaryCapillaryCapillaryCapillary
Active phase HP-InnowaxDB-WaxCP-WaxDB-WaxTC-Wax
Column length (m) 50.30.30.60.60.
Carrier gas HeliumHeHeN2He
Substrate
Column diameter (mm) 0.200.320.320.250.25
Phase thickness (μm) 0.330.250.250.250.5
Tstart (C) 50.40.40.70.40.
Tend (C) 250.230.180.230.230.
Heat rate (K/min) 10.4.5.2.3.
Initial hold (min)  2.2.2.8.
Final hold (min) 6.15. 20.
I 1960.1972.1943.1974.1984.
ReferenceDu, Clery, et al., 2008Fan and Qian, 2006Ka, Choi, et al., 2005Choi, 2004Ishikawa, Ito, et al., 2004
Comment MSDC-RI MSDC-RI MSDC-RI MSDC-RI MSDC-RI
Column type CapillaryCapillaryCapillaryCapillaryCapillary
Active phase DB-WaxDB-WaxTC-WaxHP-FFAPHP-FFAP
Column length (m) 30.30.60.25.25.
Carrier gas HeHeHeHeHe
Substrate
Column diameter (mm) 0.250.250.250.320.32
Phase thickness (μm) 0.250.25 0.50.5
Tstart (C) 50.50.80.45.45.
Tend (C) 180.230.250.220.220.
Heat rate (K/min) 3.3.4.15.15.
Initial hold (min)  2.
Final hold (min) 40.20.30.
I 1983.1966.1983.2006.2008.
ReferenceYanagimoto, Ochi, et al., 2004Lin, Cai, et al., 2003Miyazawa and Okuno, 2003Wanakhachornkrai and Lertsiri, 2003Wanakhachornkrai and Lertsiri, 2003
Comment MSDC-RI MSDC-RI MSDC-RI MSDC-RI MSDC-RI
Column type CapillaryCapillaryCapillaryCapillaryCapillary
Active phase HP-FFAPDB-WaxDB-WaxDB-WaxCarbowax 20M
Column length (m) 25.60.60.60.60.
Carrier gas He  He
Substrate
Column diameter (mm) 0.320.320.250.250.25
Phase thickness (μm) 0.5
Tstart (C) 45.30.30.60.60.
Tend (C) 220.170.170.180.180.
Heat rate (K/min) 15.2.2.2.2.
Initial hold (min)  4.4. 4.
Final hold (min)  60.30.
I 2003.1970.1970.1973.1925.
ReferenceWanakhachornkrai and Lertsiri, 2003Buttery, Orts, et al., 1999Buttery and Ling, 1998Sekiwa, Kubota, et al., 1997Kawakami, Ganguly, et al., 1995
Comment MSDC-RI MSDC-RI MSDC-RI MSDC-RI MSDC-RI
Column type CapillaryCapillaryCapillaryCapillaryCapillary
Active phase DB-WaxDB-WaxDB-WaxCarbowax 20MFFAP
Column length (m) 60.60.30.50.50.
Carrier gas HeHeHeHeHe
Substrate
Column diameter (mm) 0.250.250.250.330.28
Phase thickness (μm)
Tstart (C) 40.60.60.60.60.
Tend (C) 200.180.240.200.240.
Heat rate (K/min) 2.4.3.3.2.
Initial hold (min) 2.4.10. 5.
Final hold (min)  30.
I 1967.1957.1970.2020.1927.
ReferenceUmano, Hagi, et al., 1995Eiserich, Macku, et al., 1992Hatsuko, Kazuko, et al., 1992Vernin, Metzger, et al., 1992Vernin, Metzger, et al., 1988
Comment MSDC-RI MSDC-RI MSDC-RI MSDC-RI MSDC-RI
Column type CapillaryCapillary
Active phase DB-WaxCarbowax 20M
Column length (m) 30.150.
Carrier gas He
Substrate
Column diameter (mm) 0.250.64
Phase thickness (μm)
Tstart (C) 70.50.
Tend (C) 160.170.
Heat rate (K/min) 2.1.
Initial hold (min) 8.30.
Final hold (min)  60.
I 1959.1950.
ReferenceWong and Bernhard, 1988Buttery, Ling, et al., 1983
Comment MSDC-RI MSDC-RI

Normal alkane RI, non-polar column, temperature ramp

Data compiled by: NIST Mass Spectrometry Data Center, William E. Wallace, director

Column type CapillaryCapillaryCapillaryCapillaryCapillary
Active phase HP-5 MSHP-5 MSHP-5 MSHP-5 MSUltra-1
Column length (m) 30.30.30.30.50.
Carrier gas HeliumHeliumHeliumHeliumHelium
Substrate
Column diameter (mm) 0.250.250.250.250.20
Phase thickness (μm) 0.250.250.250.250.33
Tstart (C) 50.70.70.35.50.
Tend (C) 250.200.290.195.280.
Heat rate (K/min) 5.3.5.2.2.
Initial hold (min) 0.52. 5.
Final hold (min) 0.518.10.30.20.
I 1061.1063.1059.1060.1022.
ReferenceFanaro, Duarte, et al., 2012Jerkovic and Marijanovic, 2010Radulovic, Dordevic, et al., 2010Kim and Chung, 2009Du, Clery, et al., 2008
Comment MSDC-RI MSDC-RI MSDC-RI MSDC-RI MSDC-RI
Column type CapillaryCapillaryCapillaryCapillaryCapillary
Active phase HP-5SLB-5MSDB-5HP-5MSDB-5
Column length (m) 50.10.60.30.30.
Carrier gas HeliumHeliumHeHe
Substrate
Column diameter (mm) 0.200.180.320.250.25
Phase thickness (μm) 0.330.18 0.250.25
Tstart (C) 50.40.50.50.40.
Tend (C) 280.295.250.280.240.
Heat rate (K/min) 10.10.4.5.4.
Initial hold (min)  1.55.4.2.
Final hold (min) 8.5  10.
I 1060.1098.1060.1065.1072.
ReferenceDu, Clery, et al., 2008Risticevic, Carasek, et al., 2008Fadel, Mageed, et al., 2006Kim, Abd El-Aty, et al., 2006El-Sayed, Heppelthwaite, et al., 2005
Comment MSDC-RI MSDC-RI MSDC-RI MSDC-RI MSDC-RI
Column type CapillaryCapillaryCapillaryCapillaryCapillary
Active phase DB-5DB-5DB-5DB-5HP-5
Column length (m) 30.50.30.30.50.
Carrier gas HeliumHeliumH2He
Substrate
Column diameter (mm) 0.250.250.250.250.32
Phase thickness (μm)   0.250.250.52
Tstart (C) 60.60.60.60.35.
Tend (C) 240.240.280.240.250.
Heat rate (K/min) 2.2.4.3.2.
Initial hold (min)   10. 15.
Final hold (min) 999.999.40. 45.
I 1060.1060.1064.1059.1067.
ReferenceMiyazawa, Fuhita, et al., 2004Miyazawa, Fujita, et al., 2004Pino, Marbot, et al., 2003Tellez, Khan, et al., 2002Boylston and Viniyard, 1998
Comment MSDC-RI MSDC-RI MSDC-RI MSDC-RI MSDC-RI
Column type CapillaryCapillaryCapillaryCapillaryCapillary
Active phase DB-1DB-1DB-1DB-1DB-1
Column length (m) 60.60.60.60.60.
Carrier gas HeHeHe He
Substrate
Column diameter (mm) 0.320.320.320.250.32
Phase thickness (μm) 1.01.1.0 1.
Tstart (C) 40.40.40.30.40.
Tend (C) 260.260.280.200.280.
Heat rate (K/min) 3.3.2.4.2.
Initial hold (min)    25.2.
Final hold (min)    20.40.
I 1048.1047.1043.1024.1035.
ReferenceChen and Ho, 1998Chen, Wang, et al., 1998Tai and Ho, 1998Buttery, Ling, et al., 1997Lu, Yu, et al., 1997
Comment MSDC-RI MSDC-RI MSDC-RI MSDC-RI MSDC-RI
Column type CapillaryCapillaryCapillaryCapillaryCapillary
Active phase DB-1DB-1DB-1DB-1DB-1
Column length (m) 60.60.60.60.60.
Carrier gas HeHe
Substrate
Column diameter (mm) 0.250.320.320.320.32
Phase thickness (μm) 1. 0.250.250.25
Tstart (C) 40.30.50.50.50.
Tend (C) 260.200.250.250.250.
Heat rate (K/min) 2.4.4.4.4.
Initial hold (min) 5.25.
Final hold (min) 60.20.
I 1051.1024.1021.1022.1023.
ReferenceYu and Ho, 1995Buttery, Stern, et al., 1994Flath, Matsumoto, et al., 1989Flath, Matsumoto, et al., 1989Flath, Matsumoto, et al., 1989
Comment MSDC-RI MSDC-RI MSDC-RI MSDC-RI MSDC-RI
Column type CapillaryCapillary
Active phase DB-1DB-5
Column length (m) 60.30.
Carrier gas  Hydrogen
Substrate
Column diameter (mm) 0.320.35
Phase thickness (μm) 0.251.0
Tstart (C) 50.45.
Tend (C) 250.220.
Heat rate (K/min) 4.2.
Initial hold (min)
Final hold (min)
I 1023.1075.
ReferenceFlath, Matsumoto, et al., 1989Georgilopoulos and Gallois, 1988
Comment MSDC-RI MSDC-RI

Normal alkane RI, polar column, custom temperature program

Data compiled by: NIST Mass Spectrometry Data Center, William E. Wallace, director

Column type CapillaryCapillaryCapillaryCapillaryCapillary
Active phase DB-WaxDB-WaxDB-WaxInnowaxCarbowax 20M
Column length (m) 30.30.30.30.
Carrier gas HydrogenHydrogenHeHelium
Substrate
Column diameter (mm) 0.250.250.320.25
Phase thickness (μm) 0.250.250.250.50
Program 44 0C 3 0C/min -> 170 0C 8 0C/min -> 250 0Cnot specified45C(5min) => 5C/min => 150C => 10C/min => 240C (10min)40 0C (2 min) 10 0C/min -> 100 0C 3 0C/min -> 160 0C 5 0C/min -> 260 0C (10 min)not specified
I 1969.1949.1950.1986.1935.
ReferenceGonzalez-Rios, Suarez-Quiroz, et al., 2007Gonzalez-Rios, Suarez-Quiroz, et al., 2007Krings, Zelena, et al., 2006Ito and Mori, 2004Vinogradov, 2004
Comment MSDC-RI MSDC-RI MSDC-RI MSDC-RI MSDC-RI
Column type CapillaryCapillaryCapillary
Active phase Carbowax 20MCarbowax 20MDB-Wax
Column length (m)   30.
Carrier gas   He
Substrate
Column diameter (mm)   0.25
Phase thickness (μm)
Program not specifiednot specifiednot specified
I 1930.1930.1972.
ReferenceVernin, Lageot, et al., 1998Vernin, Lageot, et al., 1998Hatsuko, Kazuko, et al., 1992
Comment MSDC-RI MSDC-RI MSDC-RI

Kovats' RI, polar column, temperature ramp

Data compiled by: NIST Mass Spectrometry Data Center, William E. Wallace, director

Column type Capillary
Active phase DB-Wax
Column length (m) 60.
Carrier gas He
Substrate
Column diameter (mm) 0.25
Phase thickness (μm)
Tstart (C) 60.
Tend (C) 180.
Heat rate (K/min) 4.
Initial hold (min) 4.
Final hold (min) 30.
I 1952.
ReferenceYeo and Shibamoto, 1991
Comment MSDC-RI

References

Weast and Grasselli, 1989
CRC Handbook of Data on Organic Compounds, 2nd Editon, Weast,R.C and Grasselli, J.G., ed(s)., CRC Press, Inc., Boca Raton, FL, 1989, 1. [all data]
Buckingham and Donaghy, 1982
Buckingham, J.; Donaghy, S.M.,
Dictionary of Organic Compounds: Fifth Edition, Chapman and Hall, New York, 1982, 1. [all data]
Cumper and Wood, 1971
Cumper, C.W.N.; Wood, J.W.M.,
Dielectric relaxation and dipole moments of substituted pyrroles.,
J. Chem. Soc. B, 1971, 1811. [all data]
Santos, Gomes, et al., 2009
Santos, Ana Filipa L.O.M.; Gomes, Jose R.B.; Ribeiro da Silva, Manuel A.V.,
2- and 3-Acetylpyrroles: A Combined Calorimetric and Computational Study,
J. Phys. Chem. A, 2009, 113, 15, 3630-3638, https://doi.org/10.1021/jp810407m
. [all data]
Flores, Adriana Camarillo, et al., 2009
Flores, Henoc; Adriana Camarillo, E.; Mentado, Juan,
Enthalpies of combustion and formation of 2-acetylpyrrole, 2-acetylfuran and 2-acetylthiophene,
Thermochimica Acta, 2009, 493, 1-2, 76-79, https://doi.org/10.1016/j.tca.2009.04.012
. [all data]