3-Acetyl-1H-pyrroline

Phase change data

Data compiled by: William E. Acree, Jr., James S. Chickos

Quantity Value Units Method Reference Comment
Δsub94.7 ± 0.5kJ/molMESantos, Gomes, et al., 2009Based on data from 316. - 338. K.

Enthalpy of sublimation

ΔsubH (kJ/mol) Temperature (K) Method Reference Comment
93.2 ± 0.5327.MESantos, Gomes, et al., 2009Based on data from 316. - 338. K.

References

Santos, Gomes, et al., 2009
Santos, Ana Filipa L.O.M.; Gomes, Jose R.B.; Ribeiro da Silva, Manuel A.V., 2- and 3-Acetylpyrroles: A Combined Calorimetric and Computational Study, J. Phys. Chem. A, 2009, 113, 15, 3630-3638, https://doi.org/10.1021/jp810407m . [all data]