4H-Thiopyran-4-one, tetrahydro-
- Formula: C5H8OS
- Molecular weight: 116.181
- IUPAC Standard InChIKey: OVRJVKCZJCNSOW-UHFFFAOYSA-N
- CAS Registry Number: 1072-72-6
- Chemical structure:
View 3d structure (requires JavaScript / HTML 5) - Other names: 1-Thiacyclohexan-4-one; 4-Thiacyclohexanone; Penthianone; Tetrahydro-1-thio-γ-pyrone; Tetrahydro-1-thio-4-pyrone; Tetrahydro-1,4-thiapyrone; Tetrahydro-4-thiopyrone; Tetrahydro-4H-thiopyran-4-one; Tetrahydrothiopyran-4-one; 2,3,5,6-Tetrahydro-4-thiopyranone; 4-Oxotetrahydrothiopyran; 4-Oxothiane; Tetrahydrothia-4-pyranone; Tetrahydro-4H-thiapyran-4-one; 4H-tetrahydrothiopyran-4-one; 4-Thianone; NSC 41599

Gas phase thermochemistry data

Data compiled by: Hussein Y. Afeefy, Joel F. Liebman, and Stephen E. Stein
Quantity | Value | Units | Method | Reference | Comment |
---|---|---|---|---|---|
ΔfH°gas | -155. ± 2.7 | kJ/mol | Ccb | Geiseler and Sawistowsky, 1972 |

Condensed phase thermochemistry data

Data compiled by: Hussein Y. Afeefy, Joel F. Liebman, and Stephen E. Stein
Quantity | Value | Units | Method | Reference | Comment |
---|---|---|---|---|---|
ΔcH°liquid | -3485. ± 2.1 | kJ/mol | Ccb | Geiseler and Sawistowsky, 1972 |

Phase change data

Data compiled as indicated in comments:
ALS - Hussein Y. Afeefy, Joel F. Liebman, and Stephen E. Stein
AC - William E. Acree, Jr., James S. Chickos
Quantity | Value | Units | Method | Reference | Comment |
---|---|---|---|---|---|
ΔvapH° | 72.63 | kJ/mol | V | Geiseler and Sawistowsky, 1972 | ALS |
Quantity | Value | Units | Method | Reference | Comment |
ΔsubH° | 72.6 ± 1.7 | kJ/mol | N/A | Geiseler and Sawistowsky, 1972, 2 | See also Pedley and Rylance, 1977.; AC |
Enthalpy of sublimation
ΔsubH (kJ/mol) | Temperature (K) | Method | Reference | Comment |
---|---|---|---|---|
71.7 ± 1.7 | 317. | I | Geiseler and Sawistowsky, 1972, 2 | AC |

Gas phase ion energetics data

Data compiled as indicated in comments:
LLK - Sharon G. Lias, Rhoda D. Levin, and Sherif A. Kafafi
Ionization energy determinations
IE (eV) | Method | Reference | Comment |
---|---|---|---|
8.90 ± 0.05 | PE | Colonna, Distefano, et al., 1980 | LLK |

References

Geiseler and Sawistowsky, 1972
Geiseler, V.G.; Sawistowsky, J.,
Bildungsenthalpien und Mesomerieenergien von π-Bindungssystemen. 4. Mitteilung: Bildungsenthalpien einiger Thiacyclannone,
Z. Phys. Chem. (Leipzig), 1972, 250, 43-48. [all data]
Geiseler and Sawistowsky, 1972, 2
Geiseler, G.; Sawistowsky, J.,
Z. Phys. Chem. (Leipzig), 1972, 250, 1-2, 43. [all data]
Pedley and Rylance, 1977
Pedley, J.B.; Rylance, J.,
, Computer Analysed Thermochemical Data: Organic and Organometallic Compounds, University of Sussex, Brighton, 1977. [all data]