bromoethylmercury
- Formula: C2H5BrHg
- Molecular weight: 309.56
- CAS Registry Number: 107-26-6

Phase change data

Data compiled as indicated in comments:
MS - José A. Martinho Simões
AC - William E. Acree, Jr., James S. Chickos
Quantity | Value | Units | Method | Reference | Comment |
---|---|---|---|---|---|
ΔsubH° | 76.6 ± 2.9 | kJ/mol | RSC | Charnley and Skinner, 1951 | MS |
Enthalpy of sublimation
ΔsubH (kJ/mol) | Temperature (K) | Method | Reference | Comment |
---|---|---|---|---|
76.5 ± 2.9 | 294. | V | Stephenson and Malanowski, 1987 | Based on data from 285. to 303. K. See also Pilcher and Skinner, 1983, Hartley, Pritchard, et al., 1951, and Charnley and Skinner, 1951, 2.; AC |

Gas phase thermochemistry data

Data compiled by: José A. Martinho Simões
Quantity | Value | Units | Method | Reference | Comment |
---|---|---|---|---|---|
ΔfH°gas | -30.3 ± 3.9 | kJ/mol | Review | Martinho Simões | The enthalpy of formation relies on 30.2 ± 1.5 kJ/mol for the enthalpy of formation of Hg(Et)2(l). |

Condensed phase thermochemistry data

Data compiled by: José A. Martinho Simões
Quantity | Value | Units | Method | Reference | Comment |
---|---|---|---|---|---|
ΔfH°solid | -106.9 ± 2.6 | kJ/mol | Review | Martinho Simões | The enthalpy of formation relies on 30.2 ± 1.5 kJ/mol for the enthalpy of formation of Hg(Et)2(l). |

Reaction thermochemistry data

Data compiled by: José A. Martinho Simões

Individual Reactions

Mercury, diethyl- (l) + Mercury(II) bromide (cr) = 2C2H5BrHg (cr)

By formula: C4H10Hg (l) + Br2Hg (cr) = 2C2H5BrHg (cr)

Quantity Value Units Method Reference Comment
Δr-17.8 ± 1.1kcal/molRSCHartley, Pritchard, et al., 1951Please also see Pedley and Rylance, 1977 and Cox and Pilcher, 1970.

References

Charnley and Skinner, 1951
Charnley, T.; Skinner, H.A.,
J. Chem. Soc., 1951, 1921.. [all data]
Stephenson and Malanowski, 1987
Stephenson, Richard M.; Malanowski, Stanislaw,
Handbook of the Thermodynamics of Organic Compounds, 1987, https://doi.org/10.1007/978-94-009-3173-2
. [all data]
Pilcher and Skinner, 1983
Pilcher, G.; Skinner, H.A.,
Thermochemistry of organometallic compounds, 1983, 43-90, https://doi.org/10.1002/9780470771686.ch2
. [all data]
Hartley, Pritchard, et al., 1951
Hartley, K.; Pritchard, H.O.; Skinner, H.A.,
Thermochemistry of metallic alkyls. IV. Mercury diethyl and mercury diphenyl,
Trans. Faraday Soc., 1951, 47, 254, https://doi.org/10.1039/tf9514700254
. [all data]
Charnley and Skinner, 1951, 2
Charnley, T.; Skinner, H.A.,
424. Measurements of the vapour pressures of some alkylmercury halides. The latent heats of sublimation of methyl- and ethyl- mercury halides,
J. Chem. Soc., 1951, 1921, https://doi.org/10.1039/jr9510001921
. [all data]