1-Methoxycyclopentene
- Formula: C6H10O
- Molecular weight: 98.1430
- IUPAC Standard InChIKey: GKIATJNLLNNGJV-UHFFFAOYSA-N
- CAS Registry Number: 1072-59-9
- Chemical structure:
View 3d structure (requires JavaScript / HTML 5) - Permanent link for this species. Use this link for bookmarking this species for future reference.

Reaction thermochemistry data

Data compiled by: Hussein Y. Afeefy, Joel F. Liebman, and Stephen E. Stein
Individual Reactions
By formula: C6H10O + H2O = C5H8O + CH4O
Quantity | Value | Units | Method | Reference | Comment |
---|---|---|---|---|---|
ΔrH° | -5.07 ± 0.17 | kcal/mol | Cm | Hine and Arata, 1976 | liquid phase; Heat of hydrolysis |

References

Hine and Arata, 1976
Hine, J.; Arata, K.,
Keto-Enol tautomerism. I. The calorimetrical determination of the equilibrium constant for keto-enol tautomerism for cyclopentanone and acetone,
Bull. Chem. Soc. Jpn., 1976, 49, 3085-3088. [all data]