Heptane, 2,6-dimethyl-
- Formula: C9H20
- Molecular weight: 128.2551
- IUPAC Standard InChIKey: KBPCCVWUMVGXGF-UHFFFAOYSA-N
- CAS Registry Number: 1072-05-5
- Chemical structure:
View 3d structure (requires JavaScript / HTML 5) - Other names: 2,6-Dimethylheptane

Phase change data

Data compiled as indicated in comments:
BS - Robert L. Brown and Stephen E. Stein
TRC - Thermodynamics Research Center, NIST Boulder Laboratories, Chris Muzny director
AC - William E. Acree, Jr., James S. Chickos
Quantity | Value | Units | Method | Reference | Comment |
---|---|---|---|---|---|
Tboil | 408. ± 2. | K | AVG | N/A | Average of 17 values; Individual data points |
Quantity | Value | Units | Method | Reference | Comment |
Tfus | 169.55 | K | N/A | Henne and Chanan, 1944 | Uncertainty assigned by TRC = 0.5 K; TRC |
Tfus | 170.11 | K | N/A | White, Rose, et al., 1939 | Uncertainty assigned by TRC = 0.1 K; TRC |
Tfus | 169.91 | K | N/A | White, Rose, et al., 1939 | Uncertainty assigned by TRC = 0.3 K; TRC |
Quantity | Value | Units | Method | Reference | Comment |
ΔvapH° | 43.3 | kJ/mol | N/A | Reid, 1972 | See also Labbauf, Greenshields, et al., 1961.; AC |

Henry's Law data

Data compiled by: Rolf Sander
Henry's Law constant (water solution)
kH(T) = k°H exp(d(ln(kH))/d(1/T) ((1/T) - 1/(298.15 K)))
k°H = Henry's law constant for solubility in water at 298.15 K (mol/(kg*bar))
d(ln(kH))/d(1/T) = Temperature dependence constant (K)
k°H (mol/(kg*bar)) | d(ln(kH))/d(1/T) (K) | Method | Reference | Comment |
---|---|---|---|---|
0.00021 | Q | N/A | missing citation give several references for the Henry's law constants but don't assign them to specific species. |

Normal alkane RI, non-polar column, temperature ramp

Data compiled by: NIST Mass Spectrometry Data Center, William E. Wallace, director

Column type CapillaryCapillaryCapillaryCapillaryCapillary
Active phase Polydimethyl siloxane: CP-Sil 5 CBPetrocol DHPetrocol DHPONAOV-1
Column length (m) 60.100.100.50.
Carrier gas HeliumHeliumHeliumNitrogen
Substrate
Column diameter (mm) 0.250.250.250.20
Phase thickness (μm) 1.00.500.500.50
Tstart (C) 45.20.20.35.50.
Tend (C) 210.220.220.200.160.
Heat rate (K/min) 3.615.15.2.2.
Initial hold (min) 1.4515.15.15.
Final hold (min) 2.7230.30.10.
I 831.831.849.831.828.
ReferenceBramston-Cook, 2013Supelco, 2012Supelco, 2012Zhang, Ding, et al., 2009Orav, Kailas, et al., 1999
Comment MSDC-RI MSDC-RI MSDC-RI MSDC-RI MSDC-RI
Column type Capillary
Active phase OV-101
Column length (m) 50.
Carrier gas Helium
Substrate
Column diameter (mm) 0.20
Phase thickness (μm) 0.50
Tstart (C) 30.
Tend (C) 100.
Heat rate (K/min) 1.
Initial hold (min) 6.
Final hold (min)
I 826.
ReferenceOrav, Kailas, et al., 1999, 2
Comment MSDC-RI

Normal alkane RI, non-polar column, custom temperature program

Data compiled by: NIST Mass Spectrometry Data Center, William E. Wallace, director

Column type CapillaryCapillaryCapillaryCapillaryCapillary
Active phase OV-101Polydimethyl siloxanePolydimethyl siloxanesSqualaneOV-1, SE-30, Methyl silicone, SP-2100, OV-101, DB-1, etc.
Column length (m)     50.
Carrier gas     Hydrogen
Substrate
Column diameter (mm)     0.32
Phase thickness (μm)
Program not specifiednot specifiednot specifiednot specifiednot specified
I 827.828.830.824.827.
ReferenceDu and Liang, 2003Junkes, Castanho, et al., 2003Yin, Guo, et al., 2001Petrov, 1984Waggott and Davies, 1984
Comment MSDC-RI MSDC-RI MSDC-RI MSDC-RI MSDC-RI

Kovats' RI, non-polar column, temperature ramp

Data compiled by: NIST Mass Spectrometry Data Center, William E. Wallace, director

Column type CapillaryCapillaryCapillary
Active phase DB-5OV-101Apiezon L
Column length (m) 30.110.50.
Carrier gas HeHeN2
Substrate
Column diameter (mm) 0.320.250.25
Phase thickness (μm) 0.250.20
Tstart (C) 50.35.60.
Tend (C) 300.200.
Heat rate (K/min) 6.1.1.
Initial hold (min) 2.
Final hold (min)
I 828.11827.822.
ReferenceWang, Fingas, et al., 1994Hayes and Pitzer, 1982Louis, 1971
Comment MSDC-RI MSDC-RI MSDC-RI

References

Henne and Chanan, 1944
Henne, A.L.; Chanan, H.H.,
Diolefins from Allylic Chlorides II.,
J. Am. Chem. Soc., 1944, 66, 392. [all data]
White, Rose, et al., 1939
White, J.D.; Rose, F.W.; Calingaert, G.; Soroos, H.,
2,6-dimethylheptane: its synthesis, properties, and comparison with an isononane from petroleum,
J. Res. Natl. Bur. Stand. (U. S.), 1939, 22, 315. [all data]
Reid, 1972
Reid, Robert C.,
Handbook on vapor pressure and heats of vaporization of hydrocarbons and related compounds, R. C. Wilhort and B. J. Zwolinski, Texas A Research Foundation. College Station, Texas(1971). 329 pages.$10.00,
AIChE J., 1972, 18, 6, 1278-1278, https://doi.org/10.1002/aic.690180637
. [all data]
Labbauf, Greenshields, et al., 1961
Labbauf, A.; Greenshields, J.B.; Rossini, F.D.,
Heats of formation, combustion, and vaporization of the 35 nonanes and 75 decanes,
J. Chem. Eng. Data, 1961, 6, 261-263. [all data]