Propane, 1,1,1,3-tetrachloro-
- Formula: C3H4Cl4
- Molecular weight: 181.876
- IUPAC Standard InChIKey: UTACNSITJSJFHA-UHFFFAOYSA-N
- CAS Registry Number: 1070-78-6
- Chemical structure:

Condensed phase thermochemistry data

Data compiled as indicated in comments:
ALS - Hussein Y. Afeefy, Joel F. Liebman, and Stephen E. Stein
DH - Eugene S. Domalski and Elizabeth D. Hearing
Quantity | Value | Units | Method | Reference | Comment |
---|---|---|---|---|---|
ΔfH°liquid | -208.7 ± 1.1 | kJ/mol | Ccr | Kolesov, Tomareva, et al., 1970 | hf298_gas[kcal/mol]=-38.47±0.41; Kolesov and Kozina, 1986; ALS |
Quantity | Value | Units | Method | Reference | Comment |
ΔcH°liquid | -1638. ± 1.1 | kJ/mol | Ccr | Kolesov, Tomareva, et al., 1970 | hf298_gas[kcal/mol]=-38.47±0.41; Kolesov and Kozina, 1986; ALS |
Quantity | Value | Units | Method | Reference | Comment |
S°liquid | 284.30 | J/mol*K | N/A | Kolesov, Vorob'ev, et al., 1974 | DH |
Constant pressure heat capacity of liquid
Cp,liquid (J/mol*K) | Temperature (K) | Reference | Comment |
---|---|---|---|
196.40 | 298.15 | Kolesov, Vorob'ev, et al., 1974 | T = 12 to 300 K.; DH |

Phase change data

Data compiled as indicated in comments:
BS - Robert L. Brown and Stephen E. Stein
TRC - Thermodynamics Research Center, NIST Boulder Laboratories, Chris Muzny director
AC - William E. Acree, Jr., James S. Chickos
CAL - James S. Chickos, William E. Acree, Jr., Joel F. Liebman, Students of Chem 202 (Introduction to the Literature of Chemistry), University of Missouri -- St. Louis
DH - Eugene S. Domalski and Elizabeth D. Hearing
Quantity | Value | Units | Method | Reference | Comment |
---|---|---|---|---|---|
Tboil | 432.2 | K | N/A | Weast and Grasselli, 1989 | BS |
Tboil | 432. | K | N/A | Joyce, Hanford, et al., 1948 | Uncertainty assigned by TRC = 2. K; TRC |
Tboil | 430.9 | K | N/A | Stevens, 1946 | Uncertainty assigned by TRC = 2. K; TRC |
Quantity | Value | Units | Method | Reference | Comment |
Ttriple | 237.74 | K | N/A | Kolesov, Vorob'ev, et al., 1974, 2 | Crystal phase 1 phase; Uncertainty assigned by TRC = 0.02 K; TRC |
Reduced pressure boiling point
Tboil (K) | Pressure (bar) | Reference | Comment |
---|---|---|---|
352. to 354. | 0.073 | PCR Inc., 1990 | BS |
Enthalpy of vaporization
ΔvapH (kJ/mol) | Temperature (K) | Method | Reference | Comment |
---|---|---|---|---|
57.8 | 315. | A | Stephenson and Malanowski, 1987 | Based on data from 300. to 377. K.; AC |
Enthalpy of fusion
ΔfusH (kJ/mol) | Temperature (K) | Reference | Comment |
---|---|---|---|
10.49 | 237.7 | Domalski and Hearing, 1996 | AC |
Entropy of fusion
ΔfusS (J/mol*K) | Temperature (K) | Reference | Comment |
---|---|---|---|
10.03 | 219.9 | Domalski and Hearing, 1996 | CAL |
44.13 | 237.7 |
Enthalpy of phase transition
ΔHtrs (kJ/mol) | Temperature (K) | Initial Phase | Final Phase | Reference | Comment |
---|---|---|---|---|---|
2.205 | 219.9 | crystaline, II | crystaline, I | Kolesov, Vorob'ev, et al., 1974 | DH |
10.489 | 237.74 | crystaline, I | liquid | Kolesov, Vorob'ev, et al., 1974 | DH |
Entropy of phase transition
ΔStrs (J/mol*K) | Temperature (K) | Initial Phase | Final Phase | Reference | Comment |
---|---|---|---|---|---|
10.03 | 219.9 | crystaline, II | crystaline, I | Kolesov, Vorob'ev, et al., 1974 | DH |
44.12 | 237.74 | crystaline, I | liquid | Kolesov, Vorob'ev, et al., 1974 | DH |

References

Kolesov, Tomareva, et al., 1970
Kolesov, V.P.; Tomareva, E.M.; Skuratov, S.M.,
Standard enthalpy of formation of 1,1,1,3-tetrachloropropane,
Russ. J. Phys. Chem. (Engl. Transl.), 1970, 44, 1580-1581. [all data]
Kolesov and Kozina, 1986
Kolesov, V.P.; Kozina, M.P.,
Thermochemistry of organic and organohalogen compounds,
Russ. Chem. Rev., 1986, 55, 912. [all data]
Kolesov, Vorob'ev, et al., 1974
Kolesov, V.P.; Vorob'ev, V.N.; Sarzhina, E.A.; Pentin, Yu.A.; Timoshenkova, Yu.D.,
Heat capacity from 12 to 300 K, phase transitions, and thermodynamic functions of 1,1,1-trifluoro-3-chloropropane and 1,1,1,3-tetrachloropropane,
J. Chem. Thermodynam., 1974, 6, 613-628. [all data]
Weast and Grasselli, 1989
CRC Handbook of Data on Organic Compounds, 2nd Editon, Weast,R.C and Grasselli, J.G., ed(s)., CRC Press, Inc., Boca Raton, FL, 1989, 1. [all data]
Joyce, Hanford, et al., 1948
Joyce, R.M.; Hanford, W.E.; Harmon, J.,
J. Am. Chem. Soc., 1948, 70, 2529. [all data]
Stevens, 1946
Stevens, P.G.,
Some New Cyclopropanes with A Note on the Exterior Valence Angles of Cyclopropane,
J. Am. Chem. Soc., 1946, 68, 620-2. [all data]
Kolesov, Vorob'ev, et al., 1974, 2
Kolesov, V.P.; Vorob'ev, V.N.; Sarzhina, E.A.; Pentin, Y.A.; Timoshenkova, Yu.D.,
Heat capacity from 12 to 300 K, phase transitions, and thermodynamic functions of 1,1,1-trifluoro-3-chloropropane and 1,1,1,3-tetrachloropropane,
J. Chem. Thermodyn., 1974, 6, 613-28. [all data]
PCR Inc., 1990
PCR Inc.,
Research Chemicals Catalog 1990-1991, PCR Inc., Gainesville, FL, 1990, 1. [all data]
Stephenson and Malanowski, 1987
Stephenson, Richard M.; Malanowski, Stanislaw,
Handbook of the Thermodynamics of Organic Compounds, 1987, https://doi.org/10.1007/978-94-009-3173-2
. [all data]
Domalski and Hearing, 1996
Domalski, Eugene S.; Hearing, Elizabeth D.,
Heat Capacities and Entropies of Organic Compounds in the Condensed Phase. Volume III,
J. Phys. Chem. Ref. Data, 1996, 25, 1, 1, https://doi.org/10.1063/1.555985
. [all data]