2-Propenoic acid, 2-methyl-, oxiranylmethyl ester

Gas phase thermochemistry data

Data compiled by: Hussein Y. Afeefy, Joel F. Liebman, and Stephen E. Stein

Quantity Value Units Method Reference Comment
Δfgas-394.2 ± 2.7kJ/molCcbVan-Chin-Syan and Kachurina, 1987

References

Van-Chin-Syan and Kachurina, 1987
Van-Chin-Syan, Yu.Ya.; Kachurina, N.S., Thermochemical properties of oxirane derivatives, Russ. J. Phys. Chem. (Engl. Transl.), 1987, 61, 622-624. [all data]